Peptide,PTM,ModifiedAA,ModifiedPosition,PeptideUniqueToGene,ExperimentDesc,ExpID,PubmedID,ScoreType,IdentScore,LocProb,Log2FChange,PQ-val,QuantSig,PEP,MassErrorPPM
TSFSAADELFDGGK,ph,S,87,true,"Tissue atlas Arabidopsis - ProteomicsDB",114,32188942,"MaxQuant score",122.1000000,0.9604010,,,,3.7935900763841E-5,
TPLTPTVSSPR,ph,T,110,true,"Tissue atlas Arabidopsis - ProteomicsDB",114,32188942,"MaxQuant score",133.0500000,0.7725610,,,,8.3349295891821E-6,
TPLTPTVSSPR,ph,S,112,true,"Tissue atlas Arabidopsis - ProteomicsDB",114,32188942,"MaxQuant score",199.4000000,0.8338690,,,,5.7005798148945E-19,
TPLTPTVSSPR,ph,S,113,true,"Phosphorylation Early Elicitor Signaling",23,17317660,,,,,,,,
GLEIEDSDDQKDR,ph,S,124,true,"Phospho cell culture sucrose/TOR",109,30833711,,,1.0000000,,,,,
GLEIEDSDDQKDR,ub,K,128,true,"Arabidopsis ubiquitination COFRADIC",40,26744219,"MaxQuant Score",66.9890000,1.0000000,,,,9.9019998742733E-5,0.0070000
SASDGRPIPTK,ph,S,211,true,"Phospho cell culture sucrose/TOR",109,30833711,,,0.9935720,,,,,
RNGAVVSAHEMHYTENR,ph,S,263,true,"LAXIC - mannitol vs control",84b,23660473,XCorr,2.2900000,0.9750000,,,,0.017658200114965,
