Peptide,PTM,ModifiedAA,ModifiedPosition,PeptideUniqueToGene,ExperimentDesc,ExpID,PubmedID,ScoreType,IdentScore,LocProb,Log2FChange,PQ-val,QuantSig,PEP,MassErrorPPM
ELLVATDNFSNK,ng,N,293,true,"Conserved N-glycosylation",74,22633491,"MaxQuant Score",66.3690000,0.9880000,,,,0.0080000003799796,1.3450000
LMNYNDSHVTTAVR,ph,S,451,false,"atm and atr DNA damage response",88,25561503,"MASCOT Score",91.0000000,1.0000000,,,,,-0.1300000
LMNYNDSHVTTAVR,ph,S,451,false,"Tissue atlas Arabidopsis - ProteomicsDB",114,32188942,"MaxQuant score",146.7600000,0.9995190,,,,1.2656100523145E-7,
LMNYNDSHVTTAVR,ph,T,454,false,"atm and atr DNA damage response",88,25561503,"MASCOT Score",67.0000000,1.0000000,,,,,0.5500000
DSHVTTAVR,ph,T,454,false,"Tissue atlas Arabidopsis - ProteomicsDB",114,32188942,"MaxQuant score",100.0700000,0.9025190,,,,0.0032323799096048,
LMNYNDSHVTTAVR,ph,T,455,false,"Large-scale phosphorylation discovery",44,23111157,XCorr,3.0390000,,,,,,
LMNYNDSHVTTAVR,ph,T,455,false,"atm and atr DNA damage response",88,25561503,"MASCOT Score",67.0000000,1.0000000,,,,,0.5500000
GTIGHIAPEYLSTGK,ph,T,460,false,"atm and atr DNA damage response",88,25561503,"MASCOT Score",35.0000000,1.0000000,,,,,-3.7500000
GTIGHIAPEYLSTGK,ph,T,460,false,"Tissue atlas Arabidopsis - ProteomicsDB",114,32188942,"MaxQuant score",65.4230000,0.9999880,,,,0.00044692700612359,
GTIGHIAPEYLSTGK,ph,S,470,false,"atm and atr DNA damage response",88,25561503,"MASCOT Score",42.0000000,0.9440000,,,,,1.4200000
GTIGHIAPEYLSTGK,ph,S,470,false,"Tissue atlas Arabidopsis - ProteomicsDB",114,32188942,"MaxQuant score",132.5100000,0.9186330,,,,8.7204202192659E-13,
