Peptide,PTM,ModifiedAA,ModifiedPosition,PeptideUniqueToGene,ExperimentDesc,ExpID,PubmedID,ScoreType,IdentScore,LocProb,Log2FChange,PQ-val,QuantSig,PEP,MassErrorPPM
FHASTTDTLDYVVSQANLTSENLR,ng,N,187,true,"Conserved N-glycosylation",74,22633491,"MaxQuant Score",300.5300000,1.0000000,,,,0,-0.3140000
NVSDYLNAAK,ng,N,195,true,"Conserved N-glycosylation",74,22633491,"MaxQuant Score",86.1790000,1.0000000,,,,0.0040000001899898,1.3330000
NVSDYLNAAK,ng,N,195,true,"N-linked Glycan Micro-heterogeneity Arabidopsis",134,29237727,,,,,,,,
NVSDYLNAAK,ng,N,195,true,"UDP-GlcNAc transporter glycopeptide analysis",135,30224661,,,,,,,3.9671650853279E-8,0.5000000
INSSATTLSVK,ng,N,229,true,"Conserved N-glycosylation",74,22633491,"MaxQuant Score",110.4600000,1.0000000,,,,8.6740001279395E-6,0.5630000
INSSATTLSVK,ng,N,229,true,"N-linked Glycan Micro-heterogeneity Arabidopsis",134,29237727,,,,,,,,
INSSATTLSVK,ng,N,229,true,"UDP-GlcNAc transporter glycopeptide analysis",135,30224661,,,,,,,5.2810106287993E-10,0.9000000
LVTYQLVNLLDNAISNMTNR,ng,N,367,true,"Conserved N-glycosylation",74,22633491,"MaxQuant Score",158.6200000,0.7630000,,,,2.9427267750821E-44,-0.7720000
QCQPGQVHLNNATEVWK,ng,N,414,true,"Conserved N-glycosylation",74,22633491,"MaxQuant Score",138.3300000,0.9700000,,,,1.4399999744972E-21,0.8170000
QCQPGQVHLNNATEVWK,ng,N,414,true,"UDP-GlcNAc transporter glycopeptide analysis",135,30224661,,,,,,,4.8822851143882E-12,1.1000000
NFTCQIVTPGTCSTPGR,ng,N,421,true,"UDP-GlcNAc transporter glycopeptide analysis",135,30224661,,,,,,,4.2148169719994E-13,0.3000000
LYSQMAAAVNVSYGLYK,ng,N,451,true,"Conserved N-glycosylation",74,22633491,"MaxQuant Score",108.5300000,1.0000000,,,,4.6089998484433E-9,4.7620000
DHCPGLK,sno,C,484,true,"hot5-4 / wildtype, FAT-switch S-nitrosoproteome",169,37277371,,,,,,,,
DYNAMHSEDPR,ph,S,533,true,"Tissue atlas Arabidopsis - ProteomicsDB",114,32188942,"MaxQuant score",46.4620000,0.9919430,,,,0.012368500232697,
DYNAMHSEDPRSK,ph,S,538,true,"Tissue atlas Arabidopsis - ProteomicsDB",114,32188942,"MaxQuant score",43.9550000,0.9965540,,,,0.013100399635732,
