Peptide,PTM,ModifiedAA,ModifiedPosition,PeptideUniqueToGene,ExperimentDesc,ExpID,PubmedID,ScoreType,IdentScore,LocProb,Log2FChange,PQ-val,QuantSig,PEP,MassErrorPPM
ESNSVHQVSSFEMSPSSEK,ph,S,160,true,"atm and atr DNA damage response",88,25561503,"MASCOT Score",29.0000000,0.9360000,,,,,0.1800000
ESNSVHQVSSFEMSPSSEK,ph,S,160,true,"Tissue atlas Arabidopsis - ProteomicsDB",114,32188942,"MaxQuant score",194.1900000,0.7728720,,,,1.4012984643248E-45,
ESNSVHQVSSFEMSPSSEK,ph,S,162,true,"TOR Kinase and ABA Receptor",100,29290610,XCorr,3.5408654,0.9548000,,,,0.00011819999781437,
ESNSVHQVSSFEMSPSSEK,ph,S,162,true,"Tissue atlas Arabidopsis - ProteomicsDB",114,32188942,"MaxQuant score",239.9000000,0.9933600,,,,0,
ESNSVHQVSSFEMSPSSEK,ph,S,172,true,"Large-scale phosphorylation discovery",44,23111157,XCorr,3.5870000,,,,,,
ESNSVHQVSSFEMSPSSEK,ph,S,172,true,"atm and atr DNA damage response",88,25561503,"MASCOT Score",55.0000000,1.0000000,,,,,0.5400000
ESNSVHQVSSFEMSPSSEK,ph,S,172,true,"Tissue atlas Arabidopsis - ProteomicsDB",114,32188942,"MaxQuant score",239.9000000,0.9991130,,,,0,
IPQSPFR,ph,S,181,true,"TOR Kinase and ABA Receptor",100,29290610,XCorr,2.2597048,1.0000000,,,,0.0045610000379384,
IPQSPFR,ph,S,181,true,"Tissue atlas Arabidopsis - ProteomicsDB",114,32188942,"MaxQuant score",162.8800000,1.0000000,,,,0.004375500138849,
APPSPSRVPQSPSR,ph,S,188,true,"TOR Kinase and ABA Receptor",100,29290610,XCorr,2.4356287,0.9838000,,,,0.0063249999657273,
APPSPSRVPQSPSR,ph,S,188,true,"Tissue atlas Arabidopsis - ProteomicsDB",114,32188942,"MaxQuant score",106.3100000,0.9958930,,,,5.3836400184082E-5,
APPSPSRVPQSPSR,ph,S,195,true,"Tissue atlas Arabidopsis - ProteomicsDB",114,32188942,"MaxQuant score",106.3100000,0.9499950,,,,7.3229799454566E-5,
YAMSPRPSR,ph,S,202,true,"TOR Kinase and ABA Receptor",100,29290610,XCorr,2.1985331,0.9765000,,,,0.052769999951124,
YAMSPRPSR,ph,S,202,true,"Tissue atlas Arabidopsis - ProteomicsDB",114,32188942,"MaxQuant score",103.3400000,0.9999970,,,,0.00087889097630978,
GVLDDGQVVAIKR,ac,K,253,true,"Quantitative Acetylproteomics",101,29440448,,,,,,,,
GGPTDSNQTHILTQVK,ph,T,382,true,"Tissue atlas Arabidopsis - ProteomicsDB",114,32188942,"MaxQuant score",98.2920000,0.9253560,,,,3.7227600842016E-6,
GGPTDSNQTHILTQVK,ph,T,386,true,"Tissue atlas Arabidopsis - ProteomicsDB",114,32188942,"MaxQuant score",99.3430000,0.9999920,,,,1.9644199710456E-5,
