Peptide,PTM,ModifiedAA,ModifiedPosition,PeptideUniqueToGene,ExperimentDesc,ExpID,PubmedID,ScoreType,IdentScore,LocProb,Log2FChange,PQ-val,QuantSig,PEP,MassErrorPPM
GVAAFLAPPPSPPVNERR,ph,S,46,true,"Tissue atlas Arabidopsis - ProteomicsDB",114,32188942,"MaxQuant score",133.9600000,1.0000000,,,,5.4179599695559E-10,
GVAAFLAPPPSPPVNER,ph,S,46,true,"TOR Kinase and ABA Receptor",100,29290610,XCorr,3.3922532,1.0000000,,,,0.00047580001410097,
RLSSDNSPTQLGLLGIR,ph,S,55,true,"Tissue atlas Arabidopsis - ProteomicsDB",114,32188942,"MaxQuant score",256.7900000,0.9992240,,,,0,
RLSSDNSPTQLGLLGIR,ph,S,59,true,"TOR Kinase and ABA Receptor",100,29290610,XCorr,4.3776307,0.7923000,,,,4.8160000005737E-5,
LSSDNSPTQLGLLGIR,ph,S,59,true,"TOR Kinase and ABA Receptor",100,29290610,XCorr,3.5838130,0.9171000,,,,0.00015680000069551,
LSSDNSPTQLGLLGIR,ph,S,59,true,"Tissue atlas Arabidopsis - ProteomicsDB",114,32188942,"MaxQuant score",294.9400000,0.9998170,,,,0,
STTGHETPEEGSSR,ph,T,228,true,"atm and atr DNA damage response",88,25561503,"MASCOT Score",56.0000000,0.9980000,,,,,0.2200000
STTGHETPEEGSSR,ph,T,228,true,"Tissue atlas Arabidopsis - ProteomicsDB",114,32188942,"MaxQuant score",184.4800000,1.0000000,,,,1.8744099987585E-22,
EISDESSEEQRR,ph,S,258,true,"atm and atr DNA damage response",88,25561503,"MASCOT Score",46.0000000,0.9210000,,,,,-0.7900000
EISDESSEEQRR,ph,S,258,true,"Tissue atlas Arabidopsis - ProteomicsDB",114,32188942,"MaxQuant score",167.7100000,1.0000000,,,,1.022329973227E-14,
EISDESSEEQR,ph,S,258,true,"atm and atr DNA damage response",88,25561503,"MASCOT Score",55.0000000,1.0000000,,,,,-0.2300000
EISDESSEEQRR,ph,S,261,true,"atm and atr DNA damage response",88,25561503,"MASCOT Score",35.0000000,1.0000000,,,,,-0.1500000
EISDESSEEQRR,ph,S,261,true,"Tissue atlas Arabidopsis - ProteomicsDB",114,32188942,"MaxQuant score",89.4600000,1.0000000,,,,0.00013650799519382,
EISDESSEEQR,ph,S,261,true,"atm and atr DNA damage response",88,25561503,"MASCOT Score",55.0000000,0.9390000,,,,,-0.2300000
EISDESSEEQRR,ph,S,262,true,"atm and atr DNA damage response",88,25561503,"MASCOT Score",46.0000000,0.9210000,,,,,-0.7900000
SFRDEEVISFSDLDVDDLSEKPSPNR,ph,S,268,true,"Tissue atlas Arabidopsis - ProteomicsDB",114,32188942,"MaxQuant score",194.9900000,0.9866490,,,,0,
SFRDEEVISFSDLDVDDLSEKPSPNR,ph,S,278,true,"Large-scale phosphorylation discovery",44,23111157,XCorr,6.9090000,,,,,,
RPASNASGSSWVQLSK,ph,S,301,true,"atm and atr DNA damage response",88,25561503,"MASCOT Score",56.0000000,0.9970000,,,,,-0.3600000
RPASNASGSSWVQLSK,ph,S,301,true,"TOR Kinase and ABA Receptor",100,29290610,XCorr,4.1084003,0.9775000,,,,0.0053079999051988,
RPASNASGSSWVQLSK,ph,S,301,true,"Tissue atlas Arabidopsis - ProteomicsDB",114,32188942,"MaxQuant score",230.6200000,0.9999980,,,,0,
RPASNASGSSWVQLSK,ph,S,304,true,"atm and atr DNA damage response",88,25561503,"MASCOT Score",49.0000000,1.0000000,,,,,0.6200000
RPASNASGSSWVQLSK,ph,S,304,true,"Tissue atlas Arabidopsis - ProteomicsDB",114,32188942,"MaxQuant score",202.8200000,0.9988320,,,,0,
RPASNASGSSWVQLSK,ph,S,307,true,"atm and atr DNA damage response",88,25561503,"MASCOT Score",46.0000000,0.9960000,,,,,-0.0900000
RPASNASGSSWVQLSK,ph,S,307,true,"Tissue atlas Arabidopsis - ProteomicsDB",114,32188942,"MaxQuant score",194.1000000,0.9396730,,,,9.6551299108241E-36,
SQVGHSKDSEGDSSDWLPIGDSD,ph,S,335,true,"Phosphoproteomic analysis of seed maturation",42,22440515,"MASCOT Score",39.0000000,,,,,,-3.2600000
DSEGDSSDWLPIGDSD,ph,S,335,true,"srk2dei ABA signaling phopshoproteomics",83,23572148,"MASCOT Score",52.0000000,,,,,,0.0015000
DSEGDSSDWLPIGDSD,ph,S,335,true,"atm and atr DNA damage response",88,25561503,"MASCOT Score",44.0000000,1.0000000,,,,,-0.4300000
DSEGDSSDWLPIGDSD,ph,S,335,true,"Lateral root-induction - NAA vs control",106,23328941,"MASCOT Score",53.0000000,,,,,,
DSEGDSSDWLPIGDSD,ph,S,335,true,"Phospho cell culture sucrose/TOR",109,30833711,,,0.9999500,,,,,
