Peptide,PTM,ModifiedAA,ModifiedPosition,PeptideUniqueToGene,ExperimentDesc,ExpID,PubmedID,ScoreType,IdentScore,LocProb,Log2FChange,PQ-val,QuantSig,PEP,MassErrorPPM
MAESSGTTLMDLISADPTPVPAQSTSSSASSTASQPTSASASSSSHLHHPMSTK,fuc,S,4,true,"SPINDLY O-fucosylation",162,36739885,,,,,,,3.0999999046326,
ATLMQIQNDTISVAK,ph,S,76,true,"Tissue atlas Arabidopsis - ProteomicsDB",114,32188942,"MaxQuant score",183.7500000,0.9361790,,,,3.1772198796536E-25,
KPVSYSQLAR,ph,S,104,true,"Tissue atlas Arabidopsis - ProteomicsDB",114,32188942,"MaxQuant score",61.1100000,0.9315850,,,,0.0082413898780942,
LPEAPSLSSKDK,ph,S,450,true,"atm and atr DNA damage response",88,25561503,"MASCOT Score",32.0000000,0.9950000,,,,,-3.3400000
LPEAPSLSSKDK,ph,S,450,true,"Tissue atlas Arabidopsis - ProteomicsDB",114,32188942,"MaxQuant score",133.5400000,0.9041190,,,,5.4828298743814E-5,
VVQEMGKSR,ac,K,496,true,"Quantitative Acetylproteomics",101,29440448,,,,,,,,
RTSSISAGPGR,ph,S,540,true,"atm and atr DNA damage response",88,25561503,"MASCOT Score",44.0000000,0.9940000,,,,,0.0700000
RTSSISAGPGR,ph,S,540,true,"Tissue atlas Arabidopsis - ProteomicsDB",114,32188942,"MaxQuant score",96.7450000,0.9345630,,,,8.1801998021547E-5,
TSSISAGPGR,ph,S,540,true,"Lateral root-induction - NAA vs control",106,23328941,"MASCOT Score",28.0000000,,,,,,
RTSSISAGPGR,ph,S,541,true,"Large-scale phosphorylation discovery",44,23111157,XCorr,3.2380000,,,,,,
RTSSISAGPGR,ph,S,541,true,"atm and atr DNA damage response",88,25561503,"MASCOT Score",44.0000000,1.0000000,,,,,0.0700000
TSSISAGPGR,ph,S,541,true,"Phosphorylation Early Elicitor Signaling",23,17317660,,,,,,,,
TSSISAGPGR,ph,S,541,true,"STN8 phosphoproteome",38,21768351,"MASCOT Score",43.9900000,,,,,,0.0321846
TSSISAGPGR,ph,S,541,true,"Chloroplast kinase substrates",60,19376835,"MASCOT Score",44.3800000,,,,,,-1.3295000
TSSISAGPGR,ph,S,541,true,"LAXIC - ABA stress",84a,23660473,XCorr,2.5900000,0.9870000,,,,0.0010657600359991,
TSSISAGPGR,ph,S,541,true,"LAXIC - mannitol vs control",84b,23660473,XCorr,2.1800000,0.9810000,,,,3.7500001781154E-5,
TSSISAGPGR,ph,S,541,true,"SnRK2 protein kinase substrates",85,23776212,XCorr,3.1394410,0.9920000,,,,0.0014003900578246,
TSSISAGPGR,ph,S,541,true,"atm and atr DNA damage response",88,25561503,"MASCOT Score",52.0000000,0.8740000,,,,,0.4200000
TSSISAGPGR,ph,S,541,true,"TOR Kinase and ABA Receptor",100,29290610,XCorr,2.7406034,0.9964000,,,,9.0250003268011E-5,
TSSISAGPGR,ph,S,541,true,"Lateral root-induction - NAA vs control",106,23328941,"MASCOT Score",55.0000000,,0.2208492,0.4076405,NO,,
TSSISAGPGR,ph,S,541,true,"Phospho cell culture sucrose/TOR",109,30833711,,,0.9999670,,,,,
TSSISAGPGR,ph,S,541,true,"Col-0 callus - FC Col-0 vs. Col-0 Xray",111a,31410901,,43.9100000,,0.2313142,0.0000000,NO,,-0.2293889
TSSISAGPGR,ph,S,541,true,"Col-0 X-ray callus - FC Col-0 vs. Col-0 Xray",111b,31410901,,43.9100000,,0.2313142,0.0000000,NO,,-0.2293889
TSSISAGPGR,ph,S,541,true,"atm callus - FC atm vs. atm Xray",111c,31410901,,43.9100000,,-0.5881007,0.0000000,NO,,-0.2293889
TSSISAGPGR,ph,S,541,true,"atm-3 X-ray callus - FC atm vs. atm Xray",111d,31410901,,43.9100000,,-0.5881007,0.0000000,NO,,-0.2293889
TSSISAGPGR,ph,S,541,true,"Tissue atlas Arabidopsis - ProteomicsDB",114,32188942,"MaxQuant score",175.6400000,0.9999800,,,,3.428159839336E-11,
RTSSISAGPGR,ph,S,543,true,"atm and atr DNA damage response",88,25561503,"MASCOT Score",34.0000000,0.7780000,,,,,0.1500000
TSSISAGPGR,ph,S,543,true,"atm and atr DNA damage response",88,25561503,"MASCOT Score",44.0000000,0.9990000,,,,,-0.5200000
VNEFIAGVGTDAPDVEEENVFSRPSVGYDDMWAK,ph,S,1012,true,"SnRK2 protein kinase substrates",85,23776212,XCorr,5.0352631,0.8400000,,,,1.8165500350551E-15,
VNEFIAGVGTDAPDVEEENVFSRPSVGYDDMWAK,ph,S,1012,true,"TOR Kinase and ABA Receptor",100,29290610,XCorr,5.9516916,0.8287000,,,,5.9520001371993E-8,
VNEFIAGVGTDAPDVEEENVFSRPSVGYDDMWAK,ph,S,1012,true,"Tissue atlas Arabidopsis - ProteomicsDB",114,32188942,"MaxQuant score",148.9600000,0.9185490,,,,0,
TLLETSELEEEDAR,ph,S,1027,true,"srk2dei ABA signaling phopshoproteomics",83,23572148,"MASCOT Score",64.0000000,,,,,,0.0003000
TLLETSELEEEDAR,ph,S,1027,true,"Col-0 callus - FC Col-0 vs. Col-0 Xray",111a,31410901,,61.6200000,,-0.0654536,0.0000000,NO,,0.9045455
TLLETSELEEEDAR,ph,S,1027,true,"Col-0 X-ray callus - FC Col-0 vs. Col-0 Xray",111b,31410901,,61.6200000,,-0.0654536,0.0000000,NO,,0.9045455
TLLETSELEEEDAR,ph,S,1027,true,"atm callus - FC atm vs. atm Xray",111c,31410901,,61.6200000,,4.6686633,0.0000000,NO,,0.9045455
TLLETSELEEEDAR,ph,S,1027,true,"atm-3 X-ray callus - FC atm vs. atm Xray",111d,31410901,,61.6200000,,4.6686633,0.0000000,NO,,0.9045455
TLLETSELEEEDAR,ph,S,1027,true,"Tissue atlas Arabidopsis - ProteomicsDB",114,32188942,"MaxQuant score",247.6600000,0.9999620,,,,0,
YQSTYEGYGSPIREEPPPPYSYSEPQSR,ph,S,1083,true,"Conserved plant phosphoproteome - Arabidopsis",61a,20466843,"MASCOT Score",50.0000000,1.0000000,,,,,
YQSTYEGYGSPIREEPPPPYSYSEPQSR,ph,T,1084,true,"Large-scale phosphorylation discovery",44,23111157,XCorr,5.8810000,,,,,,
YQSTYEGYGSPIREEPPPPYSYSEPQSR,ph,Y,1088,true,"PAMP-triggered phosphorylation",48,24601666,"MASCOT Score",29.8100000,,,,,,
YQSTYEGYGSPIREEPPPPYSYSEPQSR,ph,S,1090,true,"Arabidopsis root NAA phosphoproteome",18a,27643528,"MaxQuant Score",73.7580000,0.7990000,,,,2.8540000585053E-8,-0.2790000
YQSTYEGYGSPIREEPPPPYSYSEPQSR,ph,S,1090,true,"Phytohormone-responsive phosphoproteins",34,20374526,"MASCOT Score",55.0000000,,,,,,4.9395800
YQSTYEGYGSPIREEPPPPYSYSEPQSR,ph,S,1090,true,"Large-scale phosphorylation discovery",44,23111157,XCorr,5.3910000,,,,,,
YQSTYEGYGSPIREEPPPPYSYSEPQSR,ph,S,1090,true,"PAMP-triggered phosphorylation",48,24601666,"MASCOT Score",45.1400000,,,,,,
YQSTYEGYGSPIREEPPPPYSYSEPQSR,ph,S,1090,true,"srk2dei ABA signaling phopshoproteomics",83,23572148,"MASCOT Score",91.0000000,,,,,,-0.0020000
YQSTYEGYGSPIREEPPPPYSYSEPQSR,ph,S,1090,true,"Tissue atlas Arabidopsis - ProteomicsDB",114,32188942,"MaxQuant score",340.9500000,1.0000000,,,,0,
SGGSKYQSTYEGYGSPIR,ph,S,1090,true,"STN8 phosphoproteome",38,21768351,"MASCOT Score",59.9300000,,,,,,-0.1629180
SGGSKYQSTYEGYGSPIR,ph,S,1090,true,"Chloroplast kinase substrates",60,19376835,"MASCOT Score",60.5900000,,,,,,-0.1629180
YQSTYEGYGSPIR,ph,S,1090,true,"STN8 phosphoproteome",38,21768351,"MASCOT Score",87.5400000,,,,,,-1.3750500
YQSTYEGYGSPIR,ph,S,1090,true,"Chloroplast kinase substrates",60,19376835,"MASCOT Score",92.5400000,,,,,,-1.2751500
YQSTYEGYGSPIR,ph,S,1090,true,"srk2dei ABA signaling phopshoproteomics",83,23572148,"MASCOT Score",64.0000000,,,,,,0.0025000
YQSTYEGYGSPIR,ph,S,1090,true,"atm and atr DNA damage response",88,25561503,"MASCOT Score",60.0000000,1.0000000,,,,,-1.1600000
YQSTYEGYGSPIR,ph,S,1090,true,"Lateral root-induction - NAA vs control",106,23328941,"MASCOT Score",34.0000000,,,,,,
YQSTYEGYGSPIR,ph,S,1090,true,"Phospho cell culture sucrose/TOR",109,30833711,,,0.9997980,,,,,
YQSTYEGYGSPIR,ph,S,1090,true,"Col-0 callus - FC Col-0 vs. Col-0 Xray",111a,31410901,,59.1900000,,0.5815423,0.0000000,NO,,1.1705661
YQSTYEGYGSPIR,ph,S,1090,true,"Col-0 X-ray callus - FC Col-0 vs. Col-0 Xray",111b,31410901,,59.1900000,,0.5815423,0.0000000,NO,,1.1705661
YQSTYEGYGSPIR,ph,S,1090,true,"atm callus - FC atm vs. atm Xray",111c,31410901,,59.1900000,,0.5019530,0.0000000,NO,,1.1705661
YQSTYEGYGSPIR,ph,S,1090,true,"atm-3 X-ray callus - FC atm vs. atm Xray",111d,31410901,,59.1900000,,0.5019530,0.0000000,NO,,1.1705661
YQSTYEGYGSPIR,ph,S,1090,true,"Touch-induced phosphorylation: 40s touch vs untouc",136,30291188,"MASCOT score",69.4500000,,-0.0496560,0.7360073,NO,,1.7035008
ESFENPVAGSGSR,ph,S,1110,true,"STN8 phosphoproteome",38,21768351,"MASCOT Score",80.8900000,,,,,,-0.1477030
ESFENPVAGSGSR,ph,S,1110,true,"Chloroplast kinase substrates",60,19376835,"MASCOT Score",72.2500000,,,,,,-0.6556090
ESFENPVAGSGSR,ph,S,1110,true,"srk2dei ABA signaling phopshoproteomics",83,23572148,"MASCOT Score",33.0000000,,,,,,0.0008000
ESFENPVAGSGSR,ph,S,1110,true,"atm and atr DNA damage response",88,25561503,"MASCOT Score",65.0000000,1.0000000,,,,,-0.1100000
ESFENPVAGSGSR,ph,S,1110,true,"Tissue atlas Arabidopsis - ProteomicsDB",114,32188942,"MaxQuant score",190.0600000,1.0000000,,,,3.3349098228874E-30,
ESFENPVAGSGSR,ph,S,1118,true,"Tissue atlas Arabidopsis - ProteomicsDB",114,32188942,"MaxQuant score",243.9200000,0.9999860,,,,0,
ESFENPVAGSGSR,ph,S,1120,true,"Tissue atlas Arabidopsis - ProteomicsDB",114,32188942,"MaxQuant score",229.2300000,0.9999610,,,,0,
SYESDDEEPRK,ph,S,1122,true,"atm and atr DNA damage response",88,25561503,"MASCOT Score",25.0000000,0.9970000,,,,,-1.4200000
SYESDDEEPRK,ph,S,1122,true,"Tissue atlas Arabidopsis - ProteomicsDB",114,32188942,"MaxQuant score",96.5330000,0.9937190,,,,7.9787103459239E-5,
SYESDDEEPR,ph,S,1122,true,"atm and atr DNA damage response",88,25561503,"MASCOT Score",38.0000000,0.9960000,,,,,-0.4700000
ESFENPVAGSGSRSYESDDEEPRK,ph,S,1125,true,"TOR Kinase and ABA Receptor",100,29290610,XCorr,3.6085248,0.8906000,,,,0.06140000000596,
SYESDDEEPRKSTGTR,ph,S,1125,true,"atm and atr DNA damage response",88,25561503,"MASCOT Score",32.0000000,0.9970000,,,,,-0.7800000
SYESDDEEPRKSTGTR,ph,S,1125,true,"Tissue atlas Arabidopsis - ProteomicsDB",114,32188942,"MaxQuant score",291.2200000,1.0000000,,,,0,
SYESDDEEPRK,ph,S,1125,true,"STN8 phosphoproteome",38,21768351,"MASCOT Score",50.8400000,,,,,,-0.9476390
SYESDDEEPRK,ph,S,1125,true,"Tyrosine phosphorylation in Arabidopsis",59,18463617,"MASCOT Score",36.0000000,,,,,,-0.9766080
SYESDDEEPRK,ph,S,1125,true,"Chloroplast kinase substrates",60,19376835,"MASCOT Score",38.5700000,,,,,,-0.5157480
SYESDDEEPRK,ph,S,1125,true,"srk2dei ABA signaling phopshoproteomics",83,23572148,"MASCOT Score",47.0000000,,,,,,0.0002000
SYESDDEEPRK,ph,S,1125,true,"LAXIC - mannitol vs control",84b,23660473,XCorr,3.7100000,1.0000000,,,,0.00041881398647092,
SYESDDEEPRK,ph,S,1125,true,"SnRK2 protein kinase substrates",85,23776212,XCorr,3.4547608,1.0000000,,,,0.056958999484777,
SYESDDEEPRK,ph,S,1125,true,"atm and atr DNA damage response",88,25561503,"MASCOT Score",54.0000000,0.9480000,,,,,-0.4900000
SYESDDEEPRK,ph,S,1125,true,"TOR Kinase and ABA Receptor",100,29290610,XCorr,3.0632226,1.0000000,,,,0.0013360000448301,
SYESDDEEPRK,ph,S,1125,true,"Phospho cell culture sucrose/TOR",109,30833711,,,0.9999960,,,,,
SYESDDEEPRK,ph,S,1125,true,"Col-0 callus - FC Col-0 vs. Col-0 Xray",111a,31410901,,41.4800000,,-0.2610380,0.0000000,NO,,0.2852712
SYESDDEEPRK,ph,S,1125,true,"Col-0 X-ray callus - FC Col-0 vs. Col-0 Xray",111b,31410901,,41.4800000,,-0.2610380,0.0000000,NO,,0.2852712
SYESDDEEPRK,ph,S,1125,true,"atm callus - FC atm vs. atm Xray",111c,31410901,,41.4800000,,1.8418380,0.0000000,NO,,0.2852712
SYESDDEEPRK,ph,S,1125,true,"atm-3 X-ray callus - FC atm vs. atm Xray",111d,31410901,,41.4800000,,1.8418380,0.0000000,NO,,0.2852712
SYESDDEEPR,ph,S,1125,true,"Ph protein kinases and peptide chip analysis",27,18433157,,,,,,,,
SYESDDEEPR,ph,S,1125,true,"STN8 phosphoproteome",38,21768351,"MASCOT Score",63.3100000,,,,,,-0.4767910
SYESDDEEPR,ph,S,1125,true,"Chloroplast kinase substrates",60,19376835,"MASCOT Score",58.0600000,,,,,,1.0834900
SYESDDEEPR,ph,S,1125,true,"LAXIC - mannitol vs control",84b,23660473,XCorr,3.0300000,1.0000000,,,,0.0044856001622975,
SYESDDEEPR,ph,S,1125,true,"SnRK2 protein kinase substrates",85,23776212,XCorr,2.7852266,1.0000000,,,,0.042818699032068,
SYESDDEEPR,ph,S,1125,true,"atm and atr DNA damage response",88,25561503,"MASCOT Score",54.0000000,0.9980000,,,,,-0.4800000
SYESDDEEPR,ph,S,1125,true,"Lateral root-induction - NAA vs control",106,23328941,"MASCOT Score",27.0000000,,-0.1557904,0.4162820,NO,,
SYESDDEEPRKSTGTR,ph,S,1133,true,"SnRK2 protein kinase substrates",85,23776212,XCorr,3.0005178,0.9320000,,,,0.022018199786544,
SYESDDEEPRKSTGTR,ph,S,1133,true,"atm and atr DNA damage response",88,25561503,"MASCOT Score",32.0000000,0.8970000,,,,,-0.7800000
SYESDDEEPRKSTGTR,ph,S,1133,true,"Tissue atlas Arabidopsis - ProteomicsDB",114,32188942,"MaxQuant score",201.6400000,0.9986840,,,,0,
