Peptide,PTM,ModifiedAA,ModifiedPosition,PeptideUniqueToGene,ExperimentDesc,ExpID,PubmedID,ScoreType,IdentScore,LocProb,Log2FChange,PQ-val,QuantSig,PEP,MassErrorPPM
MWKLKIAEGGSPW,nta,M,1,true,"Arg/N-end rule pathway Roots",80,25728785,"MASCOT Score",43.4400000,,,,,0.042319998145103,
IAEGGSPWLR,ph,S,11,true,"atm and atr DNA damage response",88,25561503,"MASCOT Score",37.0000000,1.0000000,,,,,1.0100000
IAEGGSPWLR,ph,S,11,true,"Tissue atlas Arabidopsis - ProteomicsDB",114,32188942,"MaxQuant score",109.2400000,1.0000000,,,,0.00022387299395632,
KSFSDNR,me1,K,46,true,"Arabidopsis protein methylome",123,31809900,"MaxQuant Score",153.7300000,1.0000000,,,,3.0794935052002E-41,-0.0116880
ENLISPVLPQVK,ph,S,74,true,"Tissue atlas Arabidopsis - ProteomicsDB",114,32188942,"MaxQuant score",165.6400000,1.0000000,,,,3.2984899533961E-11,
SITGALNTVLSE,nt,S,133,true,"Arg/N-end rule seed, prt6 vs. Wt",99,29168982,"MASCOT Score",46.4200000,,-0.1636660,0.7986442,NO,0.00017450000450481,1.2169868
KELFTVPYHEVNWNEAR,ac,K,286,true,"Histone deacetylases - apicidin vs control",98a,29061669,"MaxQuant Score",161.5000000,1.0000000,-0.1890000,0.4139997,NO,0,
KELFTVPYHEVNWNEAR,ac,K,286,true,"Histone deacetylases- hda14 vs WT (low light)",98c,29061669,"MaxQuant Score",180.8000000,1.0000000,0.0900000,0.9885531,NO,2.4000000934093E-16,
KELFTVPYHEVNWNEAR,ac,K,286,true,"Histone deacetylases substrates - hda14 vs WT",98e,29061669,"MaxQuant Score",142.4000000,1.0000000,-0.0380000,0.9289664,NO,1.3032075718221E-43,
KELFTVPYHEVNWNEAR,ub,K,286,true,"upl3 mutant / wildtype",168,35926874,"MaxQuant score",92.4740000,1.0000000,0.9038096,,,5.4898600865272E-7,0.3456400
NSQVLEDCPGDLNYWYR,ox,C,454,true,"SPEAR - 10 mM H2O2 / mock",138a,34619326,,,,4.5719486,0.0141920,YES,,
NSQVLEDCPGDLNYWYR,ox,C,454,true,"SPEAR - 50 mM H2O2 / mock",138b,34619326,,,,4.8639025,0.0002608,YES,,
VPKAIVGEPIDAK,ub,K,500,true,"upl3 mutant / wildtype",168,35926874,"MaxQuant score",97.2970000,1.0000000,1.3768460,0.0711990,NO,5.4660398745909E-5,-0.4497300
AIVGEPIDAKR,ac,K,510,true,"Quantitative Acetylproteomics",101,29440448,,,,,,,,
TLKNSPHVAK,ac,K,633,true,"Quantitative Acetylproteomics",101,29440448,,,,,,,,
