Peptide,PTM,ModifiedAA,ModifiedPosition,PeptideUniqueToGene,ExperimentDesc,ExpID,PubmedID,ScoreType,IdentScore,LocProb,Log2FChange,PQ-val,QuantSig,PEP,MassErrorPPM
MMNSIFGKRK,nta,M,1,true,"N-term acetylation drought responses",5,26184543,,,,,,,,
MMNSIFGKR,nta,M,1,true,"Arg/N-end rule pathway Roots",80,25728785,"MASCOT Score",44.1300000,,,,,0.079760000109673,
MMNSIFGKR,nta,M,1,true,"Arabidopsis translation initiation landscape - NTA",167a,35069635,,,,,,,,
MNSIFGKRKT,nt,M,2,true,"N-term acetylation drought responses",5,26184543,,,,,,,,
MNSIFGKRKT,nta,M,2,true,"N-term acetylation drought responses",5,26184543,,,,,,,,
MNSIFGKR,nta,M,2,true,"Arabidopsis translation initiation landscape - NTA",167a,35069635,,,,,,,,
MNSIFGKR,ub,K,8,true,"Arabidopsis ubiquitination COFRADIC",40,26744219,"MaxQuant Score",83.9480000,1.0000000,,,,0.00099830003455281,-0.1740000
MLDKSIR,ub,K,25,true,"Arabidopsis ubiquitination COFRADIC",40,26744219,"MaxQuant Score",79.4690000,1.0000000,,,,0.0080000003799796,0.2100000
LKSQLQGVSLR,ac,K,81,true,"Quantitative Acetylproteomics",101,29440448,,,,,,,,
LKSQLQGVSLR,ph,S,82,true,"Tissue atlas Arabidopsis - ProteomicsDB",114,32188942,"MaxQuant score",62.8910000,0.9999810,,,,0.013640499673784,
VVQAEATGAEDSGGIDSDLQAR,ph,S,208,true,"Tissue atlas Arabidopsis - ProteomicsDB",114,32188942,"MaxQuant score",213.7200000,0.9980570,,,,0,
