Peptide,PTM,ModifiedAA,ModifiedPosition,PeptideUniqueToGene,ExperimentDesc,ExpID,PubmedID,ScoreType,IdentScore,LocProb,Log2FChange,PQ-val,QuantSig,PEP,MassErrorPPM
SREIPSVSPKPLPK,ph,S,13,true,"Tissue atlas Arabidopsis - ProteomicsDB",114,32188942,"MaxQuant score",88.0000000,0.9969380,,,,9.2015601694584E-5,
TLEPELHRSPDETAPELGLVDEPTHTTR,ph,S,39,true,"Phospho cell culture sucrose/TOR",109,30833711,,,0.9941920,,,,,
SPDETAPELGLVDEPTHTTR,ph,S,39,true,"Tissue atlas Arabidopsis - ProteomicsDB",114,32188942,"MaxQuant score",246.6000000,0.9999970,,,,0,
NESEDSVDLEDK,ph,S,143,true,"Tissue atlas Arabidopsis - ProteomicsDB",114,32188942,"MaxQuant score",135.8100000,1.0000000,,,,2.2353500753525E-5,
SSSGVLGDSLAEK,ph,S,152,true,"Tissue atlas Arabidopsis - ProteomicsDB",114,32188942,"MaxQuant score",159.7500000,0.9971520,,,,4.3075701339212E-10,
FAHFDAQVEEEEDLSDKEGEQQVEDWPGPFSTAMK,ph,S,310,true,"Tissue atlas Arabidopsis - ProteomicsDB",114,32188942,"MaxQuant score",195.4200000,1.0000000,,,,0,
SSPTIWVPR,ph,S,354,true,"Tissue atlas Arabidopsis - ProteomicsDB",114,32188942,"MaxQuant score",130.1500000,0.9766770,,,,8.4956300270278E-6,
MDPFLGHLSDN,ph,S,760,true,"Tissue atlas Arabidopsis - ProteomicsDB",114,32188942,"MaxQuant score",167.7700000,1.0000000,,,,1.8515999497537E-11,
