Peptide,PTM,ModifiedAA,ModifiedPosition,PeptideUniqueToGene,ExperimentDesc,ExpID,PubmedID,ScoreType,IdentScore,LocProb,Log2FChange,PQ-val,QuantSig,PEP,MassErrorPPM
AMSESSENKAPSGLPIDLRGKRAF,nt,A,75,true,"Arabidopsis translation initiation landscape - NT",167b,35069635,,,,,,,,
AMSESSENKAPSGLPIDLR,nt,A,75,true,"Arg/N-end rule pathway Roots",80,25728785,"MASCOT Score",27.0100000,,,,,0.012000000104308,
AMSESSENKAPSGLPIDLR,nt,A,75,true,"Stromal N-terminome",96,26371235,"MASCOT Score",50.5800000,,,,,,
AMSESSENKAPSGLPIDLRGKRAF,nta,A,75,true,"Arabidopsis translation initiation landscape - NTA",167a,35069635,,,,,,,,
MSESSENKAPSGLPIDLRGKRAF,nt,M,76,true,"Arabidopsis translation initiation landscape - NT",167b,35069635,,,,,,,,
MSESSENKAPSGLPIDLR,nt,M,76,true,"Arg/N-end rule pathway Roots",80,25728785,"MASCOT Score",28.5500000,,,,,0.00012700000661425,
MSESSENKAPSGLPIDLR,nta,M,76,true,"FtsH12 N-terminome: WT / FtsH12 knockdown miRNA",118,33216923,"MaxQuant score",141.9500000,,,,,1.4800000371906E-6,
SESSENKAPSGLPIDLRGKRAF,nt,S,77,true,"Arabidopsis translation initiation landscape - NT",167b,35069635,,,,,,,,
SESSENKAPSGLPIDLR,nt,S,77,true,"Arg/N-end rule pathway Roots",80,25728785,"MASCOT Score",70.1500000,,,,,6.3419997786696E-7,
SESSENKAPSGLPIDLR,nt,S,77,true,"N-terminal ChaFRADIC",92,26010716,"MASCOT Score",36.2100000,,,,,1.2590000153523E-8,
SESSENKAPSGLPIDLR,nt,S,77,true,"Stromal N-terminome",96,26371235,"MASCOT Score",96.4200000,,,,,,
SESSENKAPSGLPIDLR,nt,S,77,true,"Arg/N-end rule seed, prt6 vs. Wt",99,29168982,"MASCOT Score",35.2100000,,0.1895476,0.2831616,NO,0.0020029998850077,-0.7278665
SESSENKAPSGLPIDLR,nt,S,77,true,"HUNTER N-terminome: legumain, GluC and trypsin",119,31951383,"MaxQuant score",124.7700000,,,,,,
SESSENKAPSGLPIDLR,nta,S,77,true,"N-terminal ChaFRADIC",92,26010716,"MASCOT Score",33.6900000,,,,,3.8419998418249E-6,
SESSENKAPSGLPIDLR,nta,S,77,true,"FtsH12 N-terminome: WT / FtsH12 knockdown miRNA",118,33216923,"MaxQuant score",101.4200000,,,,,1.3699999468209E-10,
GKFDQSR,ac,K,143,true,"Histone deacetylases - apicidin vs control",98a,29061669,"MaxQuant Score",147.2000000,1.0000000,0.0110000,0.9727472,NO,8.5000003480218E-8,
GKFDQSR,ac,K,143,true,"Histone deacetylases substrates - TSA vs control",98b,29061669,"MaxQuant Score",147.2000000,1.0000000,0.4390000,0.8649679,NO,8.5000003480218E-8,
GKFDQSR,ac,K,143,true,"Histone deacetylases substrates - hda14 vs WT",98e,29061669,"MaxQuant Score",122.2000000,1.0000000,1.8650000,0.0210863,YES,6.1999998024476E-7,
GKFDQSR,ac,K,143,true,"Quantitative Acetylproteomics",101,29440448,,,,,,,,
VLPDGSLMEIK,ph,S,154,true,"SIRK1 phosphorylation",86a,23820729,"MaxQuant Score",47.3060000,1.0000000,,,,1.5490000247955,7.7510000
VLPDGSLMEIKK,ac,K,159,true,"Quantitative Acetylproteomics",101,29440448,,,,,,,,
VLPDGSLMEIKK,ac,K,160,true,"Quantitative Acetylproteomics",101,29440448,,,,,,,,
AVFDNPEDVPE,nt,A,166,true,"Arg/N-end rule seed, prt6 vs. Wt",99,29168982,"MASCOT Score",21.7700000,,-0.5370388,0.0818770,NO,0.055139999836683,-1.8264353
YAGSSNWTVQEAAECVKK,sno,C,198,true,"Site-specific nitrosomeproteomic id - gsnor1-3",90b,25699590,XCorr,3.1500000,,,,,0.11410000175238,-5.9500000
YAGSSNWTVQEAAECVK,sno,C,198,true,"Site-specific nitrosomeproteomic id - gsnor1-3",90a,25699590,XCorr,4.3500000,,,,,4.3099998947582E-7,-5.3200000
YAGSSNWTVQEAAECVK,sno,C,198,true,"Site-specific nitrosomeproteomic id - gsnor1-3",90b,25699590,XCorr,4.2500000,,,,,0.020989999175072,-6.1700000
YAGSSNWTVQEAAECVK,so,C,198,true,"Arabidopsis S-sulfenylation chemoproteomics",108,31578252,"pFind PSM Score",0.1527210,,,,,,-1.5453611
SLANGPEVSKPLLETSRKGY,nt,S,212,true,"Arabidopsis translation initiation landscape - NT",167b,35069635,,,,,,,,
SRAAKAIGFIDTMIE,nt,S,314,true,"Arabidopsis translation initiation landscape - NT",167b,35069635,,,,,,,,
VNTISAGPLGSR,ph,S,314,true,"srk2dei ABA signaling phopshoproteomics",83,23572148,"MASCOT Score",50.0000000,,,,,,-0.0015000
VNTISAGPLGSR,ph,S,314,true,"atm and atr DNA damage response",88,25561503,"MASCOT Score",57.0000000,1.0000000,,,,,-0.4000000
VNTISAGPLGSR,ph,S,314,true,"Phospho cell culture sucrose/TOR",109,30833711,,,0.9994010,,,,,
VNTISAGPLGSR,ph,S,314,true,"Tissue atlas Arabidopsis - ProteomicsDB",114,32188942,"MaxQuant score",136.8300000,0.9995070,,,,1.7992299490288E-6,
GLNAMGVALDSPVFKDLNSKN,nt,G,370,true,"Arabidopsis translation initiation landscape - NT",167b,35069635,,,,,,,,
