Peptide,PTM,ModifiedAA,ModifiedPosition,PeptideUniqueToGene,ExperimentDesc,ExpID,PubmedID,ScoreType,IdentScore,LocProb,Log2FChange,PQ-val,QuantSig,PEP,MassErrorPPM
AVSPVLDR,nta,A,78,true,"Arabidopsis translation initiation landscape - NTA",167a,35069635,,,,,,,,
VSPVLDR,nt,V,79,true,"N-terminal ChaFRADIC",92,26010716,"MASCOT Score",44.4400000,,,,,0.02335000038147,
SSMASEHPFKGIFTTLPKPGGGE,nt,S,91,true,"Arabidopsis translation initiation landscape - NT",167b,35069635,,,,,,,,
TFSSMASEHPFK,ph,S,91,true,"PAMP-triggered phosphorylation",48,24601666,"MASCOT Score",50.8100000,,,,,,
TFSSMASEHPFK,ph,S,91,true,"Tyrosine phosphorylation in Arabidopsis",59,18463617,"MASCOT Score",61.0000000,,,,,,-0.8289680
TFSSMASEHPFK,ph,S,91,true,"Conserved plant phosphoproteome - Arabidopsis",61a,20466843,"MASCOT Score",48.0000000,1.0000000,,,,,
TFSSMASEHPFK,ph,S,91,true,"srk2dei ABA signaling phopshoproteomics",83,23572148,"MASCOT Score",26.0000000,,,,,,-0.0006000
TFSSMASEHPFK,ph,S,91,true,"SnRK2 protein kinase substrates",85,23776212,XCorr,2.6522212,0.9910000,,,,0.010258999653161,
TFSSMASEHPFK,ph,S,91,true,"TOR Kinase and ABA Receptor",100,29290610,XCorr,3.5070539,0.9843000,,,,6.2389997765422E-5,
TFSSMASEHPFK,ph,S,91,true,"Phospho cell culture sucrose/TOR",109,30833711,,,0.9987430,,,,,
TFSSMASEHPFK,ph,S,91,true,"Tissue atlas Arabidopsis - ProteomicsDB",114,32188942,"MaxQuant score",287.4500000,0.9995940,,,,0,
SMASEHPFKGIFTTLPKPGGGE,nt,S,92,true,"HUNTER N-terminome: legumain, GluC and trypsin",119,31951383,"MaxQuant score",68.4200000,,,,,,
ASEHPFKGIFTTLPKPGGGEFGKFYSLPALNDPR,nta,A,94,true,"FtsH12 N-terminome: WT / FtsH12 knockdown miRNA",118,33216923,"MaxQuant score",126.7600000,,,,,3.5400000815304E-19,
ASEHPFKGIFTTLPKPGGGE,nta,A,94,true,"Arabidopsis translation initiation landscape - NTA",167a,35069635,,,,,,,,
SLPALNDPRVDKLPY,nt,S,119,true,"Arabidopsis translation initiation landscape - NT",167b,35069635,,,,,,,,
NCDNFQVTK,ox,C,146,true,"OxiTRAQ Arabidopsis - 5 mM H2O2 versus control",47,24376095,,,,0.0451414,0.4367073,NO,,
NCDNFQVTK,sno,C,146,true,"Site-specific nitrosomeproteomic id - gsnor1-3",90a,25699590,XCorr,2.1219532,,,,,0.0036909999325871,-6.6719135
NCDNFQVTK,sno,C,146,true,"hot5-4 / wildtype, FAT-switch S-nitrosoproteome",169,37277371,,,,,,,,
NCDNFQVTK,so,C,146,true,"Arabidopsis S-sulfenylation chemoproteomics",108,31578252,"pFind PSM Score",0.1303740,,1.0752700,,,,-0.7851924
NCDNFQVTK,so,C,146,true,"S-sulfenylation site detection using YAP1C",110,32714340,,,,,,,,
IIDWEKTSPK,ph,S,166,true,"Phospho cell culture sucrose/TOR",109,30833711,,,0.8063420,,,,,
IIDWEKTSPK,ph,S,166,true,"Tissue atlas Arabidopsis - ProteomicsDB",114,32188942,"MaxQuant score",124.4500000,0.8394290,,,,2.5504899895168E-5,
TSPKQVEIPFKPAR,ac,K,168,false,"Quantitative Acetylproteomics",101,29440448,,,,,,,,
QVEIPFKPAR,ac,K,175,false,"Quantitative Acetylproteomics",101,29440448,,,,,,,,
DFTGVPAVVDLACMR,nt,D,183,false,"Arg/N-end rule seed, prt6 vs. Wt",99,29168982,"MASCOT Score",34.5400000,,-0.0040615,0.9947048,NO,0.16279999911785,-1.1207375
DFTGVPAVVDLACMR,nta,D,183,false,"FtsH12 N-terminome: WT / FtsH12 knockdown miRNA",118,33216923,"MaxQuant score",72.1100000,,,,,2.7100000465907E-7,
VLLQDFTGVPAVVDLACMR,so,C,195,false,"S-sulfenylation site detection using YAP1C",110,32714340,,,,,,,,
SENAVQANMELEFQR,nt,S,231,false,"Arabidopsis translation initiation landscape - NT",167b,35069635,,,,,,,,
SMVLPGVVGFKLAGKMR,nt,S,332,true,"Arabidopsis translation initiation landscape - NT",167b,35069635,,,,,,,,
GMSGLSLADR,nt,G,380,true,"Arabidopsis translation initiation landscape - NT",167b,35069635,,,,,,,,
SDETVAMIEAYLR,nt,S,422,true,"Arabidopsis translation initiation landscape - NT",167b,35069635,,,,,,,,
SDETVAMIEAY,nt,S,422,true,"Arg/N-end rule seed, prt6 vs. Wt",99,29168982,"MASCOT Score",30.6300000,,,,,0.21170000731945,-0.5935323
ANNMFVDYNEPQQDR,nt,A,435,true,"Arabidopsis translation initiation landscape - NT",167b,35069635,,,,,,,,
VYSSYLELNLDDVEPCISGPK,ox,C,465,true,"Redox kickstart of mitochondria",112,31871212,,,,-1.4744815,0.0115964,YES,,
VYSSYLELNLDDVEPCISGPK,sno,C,465,true,"Site-specific nitrosomeproteomic id - gsnor1-3",90b,25699590,XCorr,3.6400000,,,,,0.027289999648929,-4.9600000
VYSSYLELNLDDVEPCISGPK,so,C,465,true,"S-sulfenylation site detection using YAP1C",110,32714340,,,,,,,,
ADWHSCLDSK,sno,C,488,true,"Site-specific nitrosomeproteomic id - gsnor1-3",90a,25699590,XCorr,2.4200000,,,,,0.0070159998722374,-6.8100000
ADWHSCLDSK,sno,C,488,true,"Site-specific nitrosomeproteomic id - gsnor1-3",90b,25699590,XCorr,2.8400000,,,,,0.033169999718666,-7.1900000
ADWHSCLDSK,sno,C,488,true,"hot5-4 / wildtype, FAT-switch S-nitrosoproteome",169,37277371,,,,0.3695643,0.1487243,NO,,
ADWHSCLDSK,so,C,488,true,"Arabidopsis S-sulfenylation chemoproteomics",108,31578252,"pFind PSM Score",0.0052961,,1.9257200,,,,-0.9761787
ADWHSCLDSK,so,C,488,true,"S-sulfenylation site detection using YAP1C",110,32714340,,,,,,,,
SKVGFKGFAIPKEAQE,nt,S,491,true,"Arabidopsis translation initiation landscape - NT",167b,35069635,,,,,,,,
ACDLGLQVKPWIK,ox,C,553,true,"Redox kickstart of mitochondria",112,31871212,,,,-0.9938247,0.0029022,YES,,
KACDLGLQVKPWIK,so,C,553,true,"S-sulfenylation site detection using YAP1C",110,32714340,,,,,,,,
QGFNIVGYGCTTCIGNSGE,nt,Q,590,true,"HUNTER N-terminome: legumain, GluC and trypsin",119,31951383,"MaxQuant score",68.8090000,,,,,,
SVGAAITE,nt,S,612,true,"N-terminal ChaFRADIC",92,26010716,"MASCOT Score",63.1900000,,,,,0.0082769999280572,
DIVAAAVLSGNRNFE,nt,D,621,true,"Arabidopsis translation initiation landscape - NT",167b,35069635,,,,,,,,
DMTMDPPGPHNVK,mox,M,748,true,"cat2 Methionine oxidation - 1h stress",62a,25693801,"MASCOT Score",31.0000000,,0.0710288,,NO,,
DMTMDPPGPHNVK,mox,M,748,true,"cat2 Methionine oxidation - 3h stress",62b,25693801,"MASCOT Score",29.0000000,,-0.4578274,,NO,,
DMTMDPPGPHNVK,mox,M,750,true,"cat2 Methionine oxidation - 1h stress",62a,25693801,"MASCOT Score",31.0000000,,0.0710288,,NO,,
DMTMDPPGPHNVK,mox,M,750,true,"cat2 Methionine oxidation - 3h stress",62b,25693801,"MASCOT Score",29.0000000,,-0.4578274,,NO,,
DAYCLLNFGDSITTDHISPAGNIQK,so,C,763,true,"S-sulfenylation site detection using YAP1C",110,32714340,,,,,,,,
DSITTDHISPAGNIQKDSPAAKFLME,nt,D,769,true,"Arabidopsis translation initiation landscape - NT",167b,35069635,,,,,,,,
DHISPAGNIQK,nt,D,774,false,"Arabidopsis translation initiation landscape - NT",167b,35069635,,,,,,,,
KDFNSYGSR,ub,K,800,true,"Arabidopsis ubiquitination COFRADIC",40,26744219,"MaxQuant Score",78.3420000,1.0000000,,,,0.0089999996125698,0.5800000
DFNSYGSRR,ph,S,807,false,"Tissue atlas Arabidopsis - ProteomicsDB",114,32188942,"MaxQuant score",111.6300000,0.9999510,,,,0.00036946099135093,
DTIILAGAEYGSGSSR,nt,D,862,false,"Metacaspase9 substrates - in vitro rMC9",51c,23964026,"MASCOT Score",56.0000000,,4.5605318,,NO,,-0.5402738
GVKAVIAKSFER,nt,G,888,false,"Arabidopsis translation initiation landscape - NT",167b,35069635,,,,,,,,
AVIAKSFER,ac,K,895,false,"Quantitative Acetylproteomics",101,29440448,,,,,,,,
SNLVGMGIIPLCFKSGEDADTLGLTGHER,nt,S,903,true,"Arabidopsis translation initiation landscape - NT",167b,35069635,,,,,,,,
SNLVGMGIIPLCFK,ox,C,914,false,"OxiTRAQ SA and flg22 responses - SA vs mock",91a,25720653,"MASCOT Score",67.3100000,,0.5260688,0.0000000,NO,,
SNLVGMGIIPLCFK,ox,C,914,false,"OxiTRAQ SA and flg22 responses - flg22 vs mock",91b,25720653,"MASCOT Score",67.3100000,,0.5945485,0.0010000,YES,,
SNLVGMGIIPLCFK,ox,C,914,false,"Redox kickstart of mitochondria",112,31871212,,,,-1.5824127,0.0196971,YES,,
SNLVGMGIIPLCFK,so,C,914,false,"S-sulfenylation site detection using YAP1C",110,32714340,,,,,,,,
SGEDADTLGLTGHER,nt,S,917,true,"Arabidopsis translation initiation landscape - NT",167b,35069635,,,,,,,,
DTLGLTGHERYTIHLPT,nt,D,922,true,"Arabidopsis translation initiation landscape - NT",167b,35069635,,,,,,,,
GLTGHERY,nt,G,925,false,"Arabidopsis translation initiation landscape - NT",167b,35069635,,,,,,,,
RYTIHLPTDISE,nt,R,931,true,"Arabidopsis translation initiation landscape - NT",167b,35069635,,,,,,,,
SFTCTVR,ox,C,961,true,"OxiTRAQ Arabidopsis - 5 mM H2O2 versus control",47,24376095,,,,-0.1914778,0.1074104,YES,,
SFTCTVR,ox,C,961,true,"SPEAR - 10 mM H2O2 / mock",138a,34619326,,,,3.5219801,0.0000080,YES,,
SFTCTVR,ox,C,961,true,"SPEAR - 50 mM H2O2 / mock",138b,34619326,,,,3.1297369,0.0039103,YES,,
SFTCTVR,so,C,961,true,"S-sulfenylation site detection using YAP1C",110,32714340,,,,,,,,
