Peptide,PTM,ModifiedAA,ModifiedPosition,PeptideUniqueToGene,ExperimentDesc,ExpID,PubmedID,ScoreType,IdentScore,LocProb,Log2FChange,PQ-val,QuantSig,PEP,MassErrorPPM
VLASDMELDHSNETK,ph,S,10,true,"Tissue atlas Arabidopsis - ProteomicsDB",114,32188942,"MaxQuant score",51.1280000,0.9998620,,,,0.0064497999846935,
VLASDMELDHSNETK,ph,S,17,true,"SnRK2 protein kinase substrates",85,23776212,XCorr,2.6925025,1.0000000,,,,0.0031697200611234,
VLASDMELDHSNETK,ph,S,17,true,"atm and atr DNA damage response",88,25561503,"MASCOT Score",46.0000000,1.0000000,,,,,-0.8000000
VLASDMELDHSNETK,ph,S,17,true,"TOR Kinase and ABA Receptor",100,29290610,XCorr,4.0747771,1.0000000,,,,5.0300000111747E-6,
VLASDMELDHSNETK,ph,S,17,true,"Phospho cell culture sucrose/TOR",109,30833711,,,0.9999950,,,,,
VLASDMELDHSNETK,ph,S,17,true,"Tissue atlas Arabidopsis - ProteomicsDB",114,32188942,"MaxQuant score",274.0800000,0.9999930,,,,0,
TETVVESLESTDCK,ph,S,49,true,"Tissue atlas Arabidopsis - ProteomicsDB",114,32188942,"MaxQuant score",200.1900000,1.0000000,,,,2.4267099334943E-32,
TETVVESLESTDCK,ph,S,52,true,"Tissue atlas Arabidopsis - ProteomicsDB",114,32188942,"MaxQuant score",241.3200000,0.9773880,,,,0,
LVPHTVASQSEVDVASPVSEK,ph,S,68,true,"Tissue atlas Arabidopsis - ProteomicsDB",114,32188942,"MaxQuant score",143.6300000,0.9802580,,,,6.3915798237632E-25,
LVPHTVASQSEVDVASPVSEK,ph,S,70,true,"Tissue atlas Arabidopsis - ProteomicsDB",114,32188942,"MaxQuant score",248.5100000,0.9996610,,,,0,
LVPHTVASQSEVDVASPVSEKAPK,ph,S,76,true,"SnRK2 protein kinase substrates",85,23776212,XCorr,5.8966556,1.0000000,,,,0.00055731402244419,
LVPHTVASQSEVDVASPVSEKAPK,ph,S,76,true,"Tissue atlas Arabidopsis - ProteomicsDB",114,32188942,"MaxQuant score",300.9200000,1.0000000,,,,0,
LVPHTVASQSEVDVASPVSEK,ph,S,76,true,"Arabidopsis root NAA phosphoproteome",18a,27643528,"MaxQuant Score",58.8580000,0.9280000,,,,1.6050000340329E-5,0.1260000
LVPHTVASQSEVDVASPVSEK,ph,S,76,true,"STN8 phosphoproteome",38,21768351,"MASCOT Score",61.4100000,,,,,,-1.2568700
LVPHTVASQSEVDVASPVSEK,ph,S,76,true,"Phosphoproteome ethylene-regulated time response",46,24043427,"MASCOT Score",42.0300000,,,,,,15.3081000
LVPHTVASQSEVDVASPVSEK,ph,S,76,true,"Chloroplast kinase substrates",60,19376835,"MASCOT Score",41.9700000,,,,,,-0.6067450
LVPHTVASQSEVDVASPVSEK,ph,S,76,true,"srk2dei ABA signaling phopshoproteomics",83,23572148,"MASCOT Score",74.0000000,,,,,,0.0042000
LVPHTVASQSEVDVASPVSEK,ph,S,76,true,"LAXIC - ABA stress",84a,23660473,XCorr,4.3500000,0.9710000,,,,3.1300000813417E-8,
LVPHTVASQSEVDVASPVSEK,ph,S,76,true,"SnRK2 protein kinase substrates",85,23776212,XCorr,4.4073238,1.0000000,,,,6.4157397927297E-13,
LVPHTVASQSEVDVASPVSEK,ph,S,76,true,"Protein sumoylation and phosphorylation cross-talk",97,28419593,,,,,,,,
LVPHTVASQSEVDVASPVSEK,ph,S,76,true,"TOR Kinase and ABA Receptor",100,29290610,XCorr,6.0193567,0.9999000,,,,1.1619999895629E-7,
LVPHTVASQSEVDVASPVSEK,ph,S,76,true,"Lateral root-induction - NAA vs control",106,23328941,"MASCOT Score",36.0000000,,,,,,
LVPHTVASQSEVDVASPVSEK,ph,S,76,true,"Phospho cell culture sucrose/TOR",109,30833711,,,0.9957810,,,,,
LVPHTVASQSEVDVASPVSEK,ph,S,76,true,"Col-0 callus - FC Col-0 vs. Col-0 Xray",111a,31410901,,68.1500000,,-0.9335508,0.0000000,NO,,1.2088415
LVPHTVASQSEVDVASPVSEK,ph,S,76,true,"Col-0 X-ray callus - FC Col-0 vs. Col-0 Xray",111b,31410901,,68.1500000,,-0.9335508,0.0000000,NO,,1.2088415
LVPHTVASQSEVDVASPVSEK,ph,S,76,true,"atm callus - FC atm vs. atm Xray",111c,31410901,,68.1500000,,-1.4075690,0.0000000,NO,,1.2088415
LVPHTVASQSEVDVASPVSEK,ph,S,76,true,"atm-3 X-ray callus - FC atm vs. atm Xray",111d,31410901,,68.1500000,,-1.4075690,0.0000000,NO,,1.2088415
LVPHTVASQSEVDVASPVSEKAPK,ph,S,79,true,"SnRK2 protein kinase substrates",85,23776212,XCorr,5.8966556,1.0000000,,,,0.00055731402244419,
LVPHTVASQSEVDVASPVSEKAPK,ph,S,79,true,"Col-0 callus - FC Col-0 vs. Col-0 Xray",111a,31410901,,21.9400000,,-0.8299240,0.0000000,NO,,1.0104328
LVPHTVASQSEVDVASPVSEKAPK,ph,S,79,true,"Col-0 X-ray callus - FC Col-0 vs. Col-0 Xray",111b,31410901,,21.9400000,,-0.8299240,0.0000000,NO,,1.0104328
LVPHTVASQSEVDVASPVSEKAPK,ph,S,79,true,"atm callus - FC atm vs. atm Xray",111c,31410901,,21.9400000,,-1.1875793,0.0000000,NO,,1.0104328
LVPHTVASQSEVDVASPVSEKAPK,ph,S,79,true,"atm-3 X-ray callus - FC atm vs. atm Xray",111d,31410901,,21.9400000,,-1.1875793,0.0000000,NO,,1.0104328
LVPHTVASQSEVDVASPVSEKAPK,ph,S,79,true,"Tissue atlas Arabidopsis - ProteomicsDB",114,32188942,"MaxQuant score",175.7500000,1.0000000,,,,0,
LVPHTVASQSEVDVASPVSEK,ph,S,79,true,"srk2dei ABA signaling phopshoproteomics",83,23572148,"MASCOT Score",49.0000000,,,,,,0.0018000
LVPHTVASQSEVDVASPVSEK,ph,S,79,true,"TOR Kinase and ABA Receptor",100,29290610,XCorr,5.8629074,0.9994000,,,,1.253000050383E-6,
VSESSGALSLQSGSEGNSPFIR,og,S,86,true,"O-GlcNac Inflorescence Tissue",81,28154133,"MASCOT Score",57.2000000,,,,,,3.7000000
VSESSGALSLQSGSEGNSPFIR,ph,S,86,true,"Tissue atlas Arabidopsis - ProteomicsDB",114,32188942,"MaxQuant score",250.2700000,0.9730890,,,,0,
VSESSGALSLQSGSEGNSPFIR,ph,S,88,true,"Tissue atlas Arabidopsis - ProteomicsDB",114,32188942,"MaxQuant score",260.1500000,0.9524860,,,,0,
VSESSGALSLQSGSEGNSPFIR,ph,S,93,true,"Tissue atlas Arabidopsis - ProteomicsDB",114,32188942,"MaxQuant score",138.0300000,0.9999470,,,,1.8866999551263E-28,
VSESSGALSLQSGSEGNSPFIR,ph,S,98,true,"Phospho cell culture sucrose/TOR",109,30833711,,,0.9184800,,,,,
VSESSGALSLQSGSEGNSPFIR,ph,S,98,true,"Tissue atlas Arabidopsis - ProteomicsDB",114,32188942,"MaxQuant score",301.3600000,0.9865950,,,,0,
VSESSGALSLQSGSEGNSPFIR,ph,S,102,true,"Tissue atlas Arabidopsis - ProteomicsDB",114,32188942,"MaxQuant score",201.6100000,0.9991120,,,,0,
EKVMEDGYNWR,ub,K,108,true,"Arabidopsis ubiquitination COFRADIC",40,26744219,"MaxQuant Score",67.3850000,1.0000000,,,,0.00041700000292622,-0.2070000
ITGDNTHKDYNSPTAKR,ph,S,269,true,"Tissue atlas Arabidopsis - ProteomicsDB",114,32188942,"MaxQuant score",152.0600000,0.9756340,,,,5.6100301487616E-11,
ITGDNTHKDYNSPTAK,ph,S,269,true,"Phospho cell culture sucrose/TOR",109,30833711,,,0.7717900,,,,,
DYNSPTAK,ph,S,269,true,"atm and atr DNA damage response",88,25561503,"MASCOT Score",39.0000000,0.9410000,,,,,-1.3200000
KKGGNIELSPVER,ub,K,277,true,"Arabidopsis ubiquitination COFRADIC",40,26744219,"MaxQuant Score",167.3700000,0.9770000,,,,3.4050011254782E-40,-0.0840000
KKGGNIELSPVER,ph,S,284,true,"Tissue atlas Arabidopsis - ProteomicsDB",114,32188942,"MaxQuant score",147.2600000,1.0000000,,,,3.0447001364564E-8,
KGGNIELSPVER,ph,S,284,true,"atm and atr DNA damage response",88,25561503,"MASCOT Score",45.0000000,1.0000000,,,,,-0.9900000
KGGNIELSPVER,ph,S,284,true,"TOR Kinase and ABA Receptor",100,29290610,XCorr,3.3124366,1.0000000,,,,0.0302700009197,
KGGNIELSPVER,ph,S,284,true,"Phospho cell culture sucrose/TOR",109,30833711,,,1.0000000,,,,,
GGNIELSPVER,ph,S,284,true,"atm and atr DNA damage response",88,25561503,"MASCOT Score",66.0000000,1.0000000,,,,,0.1400000
GGNIELSPVER,ph,S,284,true,"Protein sumoylation and phosphorylation cross-talk",97,28419593,,,,,,,,
GGNIELSPVER,ph,S,284,true,"TOR Kinase and ABA Receptor",100,29290610,XCorr,3.3911395,1.0000000,,,,0.0075670001097023,
SSHDTKLLITTYEGKHDHDMPPGR,nt,S,346,true,"Arabidopsis translation initiation landscape - NT",167b,35069635,,,,,,,,
VVTHNNMLDSEVDDKEGDANKTPQSSTLQSITK,ph,T,391,true,"Tissue atlas Arabidopsis - ProteomicsDB",114,32188942,"MaxQuant score",244.3300000,0.9999430,,,,0,
EGDANKTPQSSTLQSITK,ph,T,391,true,"TOR Kinase and ABA Receptor",100,29290610,XCorr,2.7828925,0.9994000,,,,0.001589999999851,
TNGFEKSLDQGPVLDEK,ac,K,421,true,"Histone deacetylases - apicidin vs control",98a,29061669,"MaxQuant Score",104.2000000,1.0000000,0.6820000,0.0100462,YES,1.899999979571E-8,
TNGFEKSLDQGPVLDEK,ac,K,421,true,"Histone deacetylases substrates - hda14 vs WT",98e,29061669,"MaxQuant Score",62.9000000,1.0000000,0.0060000,0.9954054,NO,7.5999996624887E-5,
TNGFEKSLDQGPVLDEK,ac,K,421,true,"Quantitative Acetylproteomics",101,29440448,,,,,,,,
SLDQGPVLDEK,ph,S,422,true,"Tissue atlas Arabidopsis - ProteomicsDB",114,32188942,"MaxQuant score",92.7470000,1.0000000,,,,0.00032584500149824,
SDDKTTVCQEK,ph,S,458,true,"Tissue atlas Arabidopsis - ProteomicsDB",114,32188942,"MaxQuant score",89.6130000,0.9994980,,,,0.00082413497148082,
AVGTLESEEQKPK,ph,S,475,true,"atm and atr DNA damage response",88,25561503,"MASCOT Score",34.0000000,0.9270000,,,,,-5.0100000
AVGTLESEEQKPK,ph,S,475,true,"Tissue atlas Arabidopsis - ProteomicsDB",114,32188942,"MaxQuant score",148.6200000,1.0000000,,,,1.4843900544292E-6,
