Peptide,PTM,ModifiedAA,ModifiedPosition,PeptideUniqueToGene,ExperimentDesc,ExpID,PubmedID,ScoreType,IdentScore,LocProb,Log2FChange,PQ-val,QuantSig,PEP,MassErrorPPM
NPPLSNLTKDQLK,ng,N,104,true,"Conserved N-glycosylation",74,22633491,"MaxQuant Score",112.2500000,0.9980000,,,,1.5039999468058E-8,-0.6190000
AQKNPPLSNLTK,ng,N,104,true,"N-glycan occupancy Arabidopsis glycoproteins",87,23994444,"Ladder score",53.6000000,,,,,,
AQKNPPLSNLTK,ng,N,104,true,"UDP-GlcNAc transporter glycopeptide analysis",135,30224661,,,,,,,1.8746940000369E-8,0.7000000
NPPLSNLTK,ng,N,104,true,"N-glycan occupancy Arabidopsis glycoproteins",87,23994444,"Ladder score",66.7000000,,,,,,
NPPLSNLTK,ng,N,104,true,"N-linked Glycan Micro-heterogeneity Arabidopsis",134,29237727,,,,,,,,
NPPLSNLTK,ng,N,104,true,"UDP-GlcNAc transporter glycopeptide analysis",135,30224661,,,,,,,1.0614773771067E-7,0.6000000
NLSQSGPVSTFAGGQYSLK,ng,N,130,true,"Conserved N-glycosylation",74,22633491,"MaxQuant Score",86.2260000,1.0000000,,,,0.0004629000031855,-0.6550000
NLSQSGPVSTFAGGQYSLK,ng,N,130,true,"N-linked Glycan Micro-heterogeneity Arabidopsis",134,29237727,,,,,,,,
NLSQSGPVSTFAGGQYSLK,ng,N,130,true,"UDP-GlcNAc transporter glycopeptide analysis",135,30224661,,,,,,,1.3532375937748E-21,0.4000000
