Peptide,PTM,ModifiedAA,ModifiedPosition,PeptideUniqueToGene,ExperimentDesc,ExpID,PubmedID,ScoreType,IdentScore,LocProb,Log2FChange,PQ-val,QuantSig,PEP,MassErrorPPM
LSVPQPTIGR,ph,T,23,true,"Tissue atlas Arabidopsis - ProteomicsDB",114,32188942,"MaxQuant score",83.0810000,0.9999960,,,,0.0062947599217296,
TYPSFPYTPTPTPSK,ph,S,30,true,"Tissue atlas Arabidopsis - ProteomicsDB",114,32188942,"MaxQuant score",66.2150000,0.9932420,,,,0.00090055097825825,
TYPSFPYTPTPTPSK,ph,Y,33,true,"TOR Kinase and ABA Receptor",100,29290610,XCorr,3.0181780,0.8908000,,,,0.00097290001576766,
TYPSFPYTPTPTPSK,ph,Y,33,true,"Tissue atlas Arabidopsis - ProteomicsDB",114,32188942,"MaxQuant score",75.8190000,0.7645930,,,,0.0013820299645886,
TYPSFPYTPTPTPSK,ph,T,34,true,"atm and atr DNA damage response",88,25561503,"MASCOT Score",24.0000000,0.9960000,,,,,-1.5700000
TYPSFPYTPTPTPSK,ph,T,34,true,"Tissue atlas Arabidopsis - ProteomicsDB",114,32188942,"MaxQuant score",182.7000000,0.8628440,,,,1.0316900412184E-24,
TYPSFPYTPTPTPSK,ph,T,36,true,"Tissue atlas Arabidopsis - ProteomicsDB",114,32188942,"MaxQuant score",207.3900000,0.8516830,,,,8.4077907859489E-45,
TYPSFPYTPTPTPSK,ph,T,38,true,"atm and atr DNA damage response",88,25561503,"MASCOT Score",24.0000000,0.9960000,,,,,-1.5700000
TYPSFPYTPTPTPSK,ph,T,38,true,"Tissue atlas Arabidopsis - ProteomicsDB",114,32188942,"MaxQuant score",168.4100000,0.9176810,,,,2.8147698930648E-17,
LSSSSSYR,ph,S,48,true,"Tissue atlas Arabidopsis - ProteomicsDB",114,32188942,"MaxQuant score",114.9700000,0.8732800,,,,0.0032949699088931,
LSSSSSYR,ph,S,49,true,"Tissue atlas Arabidopsis - ProteomicsDB",114,32188942,"MaxQuant score",75.6520000,0.7521710,,,,0.010961799882352,
SFSSISSLSSSQIK,ph,S,128,true,"atm and atr DNA damage response",88,25561503,"MASCOT Score",26.0000000,0.9250000,,,,,0.4100000
SFSSISSLSSSQIK,ph,S,128,true,"Tissue atlas Arabidopsis - ProteomicsDB",114,32188942,"MaxQuant score",100.5400000,0.9805600,,,,0.00012911600060761,
