Peptide,PTM,ModifiedAA,ModifiedPosition,PeptideUniqueToGene,ExperimentDesc,ExpID,PubmedID,ScoreType,IdentScore,LocProb,Log2FChange,PQ-val,QuantSig,PEP,MassErrorPPM
CDAAVAEKETTEEGSGEKFEYQAEVSR,nt,C,61,true,"Arabidopsis translation initiation landscape - NT",167b,35069635,,,,,,,,
CDAAVAEK,so,C,61,true,"S-sulfenylation site detection using YAP1C",110,32714340,,,,,,,,
DAAVAEKETTEEGSGEKFEYQAEVSR,nt,D,62,true,"Stromal N-terminome",96,26371235,"MASCOT Score",57.1200000,,,,,,
DAAVAEKETTEEGSGEKFEYQAEVSR,nt,D,62,true,"HUNTER N-terminome: legumain, GluC and trypsin",119,31951383,"MaxQuant score",173.4400000,,,,,,
DAAVAEKETTEEGSGEKFEYQAEVSR,nt,D,62,true,"Arabidopsis translation initiation landscape - NT",167b,35069635,,,,,,,,
AAVAEKETTEEGSGEKFEYQAEVSRLL,nt,A,63,true,"Arabidopsis translation initiation landscape - NT",167b,35069635,,,,,,,,
AAVAEKETTEEGSGEKFEYQAEVSR,nt,A,63,true,"Stromal N-terminome",96,26371235,"MASCOT Score",45.9500000,,,,,,
AAVAEKETTEEGSGEKFEYQAEVSR,nt,A,63,true,"HUNTER N-terminome: legumain, GluC and trypsin",119,31951383,"MaxQuant score",81.3410000,,,,,,
AVAEKETTEEGSGEKFEYQAEVSR,nt,A,64,true,"Arabidopsis translation initiation landscape - NT",167b,35069635,,,,,,,,
ETTEEGSGEKFEYQAEVSR,nt,E,69,true,"Metacaspase9 substrates - in vitro rMC9",51c,23964026,"MASCOT Score",64.0000000,,,,,,-0.4751527
ELVSNASDALDKLR,ac,K,117,true,"Quantitative Acetylproteomics",101,29440448,,,,,,,,
ELVSNASDALDKLR,ub,K,117,true,"Arabidopsis ubiquitination COFRADIC",40,26744219,"MaxQuant Score",70.3730000,1.0000000,,,,4.2000001485576E-6,-0.4930000
EELIDCLGTIAQSGTSK,sno,C,165,true,"Site-specific nitrosomeproteomic id - gsnor1-3",90a,25699590,XCorr,4.0660691,,,,,1.1080000149377E-5,-5.8770097
EELIDCLGTIAQSGTSK,sno,C,165,true,"Site-specific nitrosomeproteomic id - gsnor1-3",90b,25699590,XCorr,4.4900000,,,,,0.010820000432432,-6.3500000
EELIDCLGTIAQSGTSK,sno,C,165,true,"hot5-4 / wildtype, FAT-switch S-nitrosoproteome",169,37277371,,,,1.0216160,0.0001958,YES,,
EELIDCLGTIAQSGTSK,so,C,165,true,"Arabidopsis S-sulfenylation chemoproteomics",108,31578252,"pFind PSM Score",0.0002569,,1.3956200,,,,0.3705909
EELIDCLGTIAQSGTSK,so,C,165,true,"S-sulfenylation site detection using YAP1C",110,32714340,,,,,,,,
EDDKYEFAESTR,ac,K,262,true,"Quantitative Acetylproteomics",101,29440448,,,,,,,,
SRTIEVEEDEPVKEGEEGEPK,ph,S,293,true,"Phospho cell culture sucrose/TOR",109,30833711,,,0.7711740,,,,,
EVEKGEYNEFYKK,ac,K,353,true,"Quantitative Acetylproteomics",101,29440448,,,,,,,,
SILYIPGMGPLNNEDVTNPKTKNIR,nt,S,378,true,"Arabidopsis translation initiation landscape - NT",167b,35069635,,,,,,,,
VFISDDFDGELFPR,nt,V,408,false,"Stromal N-terminome",96,26371235,"MASCOT Score",33.1700000,,,,,,
LGCIEDTGNHK,sno,C,492,true,"hot5-4 / wildtype, FAT-switch S-nitrosoproteome",169,37277371,,,,-0.0268233,0.6217905,NO,,
LGCIEDTGNHKR,so,C,492,true,"S-sulfenylation site detection using YAP1C",110,32714340,,,,,,,,
LGCIEDTGNHK,so,C,492,true,"Arabidopsis S-sulfenylation chemoproteomics",108,31578252,"pFind PSM Score",0.1004060,,1.1729400,,,,0.8213797
SAKSAPFLEK,ac,K,546,true,"Quantitative Acetylproteomics",101,29440448,,,,,,,,
SAPFLEKLIQK,ac,K,553,true,"Quantitative Acetylproteomics",101,29440448,,,,,,,,
KFVDISKEDLELGDEDEVKDR,nt,K,583,true,"Metacaspase9 substrates - in vitro rMC9",51c,23964026,"MASCOT Score",73.0000000,,,,,,-0.6706831
FVDISKEDLELGDEDEVKDR,ph,S,588,true,"Phospho cell culture sucrose/TOR",109,30833711,,,1.0000000,,,,,
QEFNLLCDWIK,sno,C,613,true,"hot5-4 / wildtype, FAT-switch S-nitrosoproteome",169,37277371,,,,1.5156106,0.0002535,YES,,
QEFNLLCDWIKQQLGDKVAK,so,C,613,true,"S-sulfenylation site detection using YAP1C",110,32714340,,,,,,,,
LSSSPCVLVSGK,ph,S,635,false,"Tissue atlas Arabidopsis - ProteomicsDB",114,32188942,"MaxQuant score",105.9500000,0.9840430,,,,8.660439925734E-5,
LSSSPCVLVSGK,ox,C,638,false,"OxiTRAQ Arabidopsis - 5 mM H2O2 versus control",47,24376095,,,,0.4009766,0.0131603,NO,,
LSSSPCVLVSGK,ox,C,638,false,"Redox kickstart of mitochondria",112,31871212,,,,-1.3563196,0.0011494,YES,,
LSSSPCVLVSGK,ox,C,638,false,"SPEAR - 10 mM H2O2 / mock",138a,34619326,,,,-2.8301562,0.0272571,YES,,
LSSSPCVLVSGK,sno,C,638,false,"Site-specific nitrosomeproteomic id - gsnor1-3",90a,25699590,XCorr,2.0772061,,,,,0.0099430000409484,-7.1671099
LSSSPCVLVSGK,sno,C,638,false,"Site-specific nitrosomeproteomic id - gsnor1-3",90b,25699590,XCorr,2.4000000,,,,,0.15770000219345,-6.8700000
LSSSPCVLVSGK,sno,C,638,false,"hot5-4 / wildtype, FAT-switch S-nitrosoproteome",169,37277371,,,,,,,,
VQVSNRLSSSPCVLVSGK,so,C,638,true,"S-sulfenylation site detection using YAP1C",110,32714340,,,,,,,,
LSSSPCVLVSGK,so,C,638,false,"Arabidopsis S-sulfenylation chemoproteomics",108,31578252,"pFind PSM Score",0.0118407,,0.8366100,,,,-0.9136178
ALGDTSSLEFMR,nt,A,659,true,"Arg/N-end rule seed, prt6 vs. Wt",99,29168982,"MASCOT Score",20.9500000,,-0.2756625,0.0379451,NO,0.17859999835491,-3.7388979
ALGDTSSLE,nt,A,659,true,"Arg/N-end rule seed, prt6 vs. Wt",99,29168982,"MASCOT Score",59.6400000,,-0.2923232,0.1822454,NO,0.00041680000140332,0.4348269
DLNAACK,ox,C,691,true,"OxiTRAQ Arabidopsis - 5 mM H2O2 versus control",47,24376095,,,,0.3853563,0.0078022,NO,,
DLNAACK,sno,C,691,true,"hot5-4 / wildtype, FAT-switch S-nitrosoproteome",169,37277371,,,,0.9185746,0.0007632,YES,,
ILEINPDHPIIKDLNAACK,so,C,691,true,"S-sulfenylation site detection using YAP1C",110,32714340,,,,,,,,
NAPESTEATR,nt,N,693,true,"Metacaspase9 substrates - in vitro rMC9",51c,23964026,"MASCOT Score",59.0000000,,1.8554785,,NO,,-0.0873716
NAPESTEATR,nt,N,693,true,"Arg/N-end rule seed, prt6 vs. Wt",99,29168982,"MASCOT Score",38.8700000,,-0.0321938,0.8655869,NO,0.021959999576211,-0.9885799
TAIISSGFTPDSPAE,nt,T,710,true,"Arg/N-end rule seed, prt6 vs. Wt",99,29168982,"MASCOT Score",69.5200000,,-1.4907548,0.0750566,NO,3.9700001508436E-8,-1.0744981
IISSGFTPDSPAE,nt,I,712,true,"Arg/N-end rule seed, prt6 vs. Wt",99,29168982,"MASCOT Score",71.0000000,,-0.4797476,0.0648829,NO,9.5289998114367E-8,-2.0853095
VEEEEESSTVNEGDDK,ph,S,750,true,"Tissue atlas Arabidopsis - ProteomicsDB",114,32188942,"MaxQuant score",285.1800000,0.9887810,,,,0,
WGRVEEEEESSTVNEGDDK,ph,S,751,true,"TOR Kinase and ABA Receptor",100,29290610,XCorr,4.8509150,0.9984000,,,,1.9039999870074E-6,
VEEEEESSTVNEGDDK,ph,S,751,true,"Tissue atlas Arabidopsis - ProteomicsDB",114,32188942,"MaxQuant score",213.9400000,0.8101700,,,,0,
VEEEEESSTVNEGDDK,ph,T,752,true,"Tissue atlas Arabidopsis - ProteomicsDB",114,32188942,"MaxQuant score",202.9300000,0.9442380,,,,0,
