Peptide,PTM,ModifiedAA,ModifiedPosition,PeptideUniqueToGene,ExperimentDesc,ExpID,PubmedID,ScoreType,IdentScore,LocProb,Log2FChange,PQ-val,QuantSig,PEP,MassErrorPPM
NLDSPVQTQMAVAVFK,ph,S,7,true,"Tissue atlas Arabidopsis - ProteomicsDB",114,32188942,"MaxQuant score",162.2600000,1.0000000,,,,1.5952999893863E-14,
NDSPLLLK,ph,S,106,false,"Phosphorylation Early Elicitor Signaling",23,17317660,,,,,,,,
NDSPLLLK,ph,S,106,false,"Tissue atlas Arabidopsis - ProteomicsDB",114,32188942,"MaxQuant score",132.8800000,1.0000000,,,,0.0027880899142474,
SSSTPCLSPTGR,ph,S,120,true,"atm and atr DNA damage response",88,25561503,"MASCOT Score",42.0000000,0.9390000,,,,,0.0800000
SSSTPCLSPTGR,ph,S,120,true,"Tissue atlas Arabidopsis - ProteomicsDB",114,32188942,"MaxQuant score",134.1800000,0.9977750,,,,2.751419924607E-5,
SSSTPCLSPTGR,ph,S,125,true,"atm and atr DNA damage response",88,25561503,"MASCOT Score",37.0000000,0.9970000,,,,,-0.0200000
SSSTPCLSPTGR,ph,S,125,true,"Tissue atlas Arabidopsis - ProteomicsDB",114,32188942,"MaxQuant score",157.2200000,0.9431200,,,,9.3416696600457E-10,
LSTSMKNTHLSDTTR,ph,S,562,true,"Tissue atlas Arabidopsis - ProteomicsDB",114,32188942,"MaxQuant score",98.7020000,0.9379540,,,,6.6273200900469E-6,
SANEQLPVSASFVK,ph,S,593,true,"Tyrosine phosphorylation in Arabidopsis",59,18463617,"MASCOT Score",64.0000000,,,,,,-1.0927370
SANEQLPVSASFVK,ph,S,593,true,"srk2dei ABA signaling phopshoproteomics",83,23572148,"MASCOT Score",67.0000000,,,,,,-0.0006000
SANEQLPVSASFVK,ph,S,593,true,"atm and atr DNA damage response",88,25561503,"MASCOT Score",70.0000000,1.0000000,,,,,-0.8900000
SANEQLPVSASFVK,ph,S,593,true,"TOR Kinase and ABA Receptor",100,29290610,XCorr,3.7339125,1.0000000,,,,5.444999987958E-5,
SANEQLPVSASFVK,ph,S,593,true,"Tissue atlas Arabidopsis - ProteomicsDB",114,32188942,"MaxQuant score",85.3990000,0.9999930,,,,1.2987300124223E-9,
QRLGTSCQF,ph,S,647,false,"Tissue atlas Arabidopsis - ProteomicsDB",114,32188942,"MaxQuant score",79.4270000,0.9449470,,,,0.0090394299477339,
