Peptide,PTM,ModifiedAA,ModifiedPosition,PeptideUniqueToGene,ExperimentDesc,ExpID,PubmedID,ScoreType,IdentScore,LocProb,Log2FChange,PQ-val,QuantSig,PEP,MassErrorPPM
GRGNSCGGGQSSLDYLFG,nt,G,2,true,"Arg/N-end rule seed, prt6 vs. Wt",99,29168982,"MASCOT Score",47.1600000,,-0.3931734,0.1034180,NO,0.00011950000043726,-0.6534046
GRGNSCGGGQSSLDY,nt,G,2,true,"Arabidopsis translation initiation landscape - NT",167b,35069635,,,,,,,,
GRGNSCGGGQSSLD,nt,G,2,true,"Arg/N-end rule seed, prt6 vs. Wt",99,29168982,"MASCOT Score",29.6800000,,-0.5171099,0.0222291,NO,0.00064199999906123,-0.8976376
GRGNSCGGGQSSLDYLFGGDAPAPKPVPAPR,me1,R,3,true,"Arabidopsis protein methylome",123,31809900,"MaxQuant Score",84.7410000,1.0000000,,,,9.2546097843426E-21,0.0110650
GNSCGGGQSSLDYLFGGDAPAPKPVPAPR,ph,S,6,true,"Phospho cell culture sucrose/TOR",109,30833711,,,1.0000000,,,,,
GNSCGGGQSSLDYLFGGDAPAPKPVPAPR,ph,S,6,true,"Tissue atlas Arabidopsis - ProteomicsDB",114,32188942,"MaxQuant score",338.8800000,1.0000000,,,,0,
GNSCGGGQSSLDYLFGGDAPAPKPVPAPR,so,C,7,true,"S-sulfenylation site detection using YAP1C",110,32714340,,,,,,,,
GNSCGGGQSSLDYLFGGDAPAPKPVPAPR,ub,K,26,true,"Arabidopsis ubiquitination COFRADIC",40,26744219,"MaxQuant Score",177.3500000,1.0000000,,,,0,-1.0350000
QIPAGIKTPVNNYAR,ph,T,76,true,"atm and atr DNA damage response",88,25561503,"MASCOT Score",41.0000000,1.0000000,,,,,0.0700000
QIPAGIKTPVNNYAR,ph,T,76,true,"Tissue atlas Arabidopsis - ProteomicsDB",114,32188942,"MaxQuant score",204.6700000,1.0000000,,,,2.3822073893522E-44,
VHAAPGGGSSLDYLFTGGK,ph,S,109,true,"Large-scale phosphorylation discovery",44,23111157,XCorr,3.9530000,,,,,,
VHAAPGGGSSLDYLFTGGK,ph,S,109,true,"Tissue atlas Arabidopsis - ProteomicsDB",114,32188942,"MaxQuant score",109.3800000,0.9141630,,,,4.6262099706595E-10,
VHAAPGGGSSLDYLFTGGK,ph,S,110,true,"Large-scale phosphorylation discovery",44,23111157,XCorr,4.2690000,,,,,,
VHAAPGGGSSLDYLFTGGK,ph,S,110,true,"Tissue atlas Arabidopsis - ProteomicsDB",114,32188942,"MaxQuant score",145.3100000,0.9502970,,,,1.0389999780139E-17,
