Peptide,PTM,ModifiedAA,ModifiedPosition,PeptideUniqueToGene,ExperimentDesc,ExpID,PubmedID,ScoreType,IdentScore,LocProb,Log2FChange,PQ-val,QuantSig,PEP,MassErrorPPM
SSRHPSITGAPQETDIGGGY,nt,S,50,true,"Arabidopsis translation initiation landscape - NT",167b,35069635,,,,,,,,
SRHPSITGAPQETDIGGGY,nt,S,51,true,"Arabidopsis translation initiation landscape - NT",167b,35069635,,,,,,,,
HPSITGAPQETDIGGGYR,ph,S,55,true,"atm and atr DNA damage response",88,25561503,"MASCOT Score",37.0000000,0.9380000,,,,,0.0200000
HPSITGAPQETDIGGGYR,ph,S,55,true,"Tissue atlas Arabidopsis - ProteomicsDB",114,32188942,"MaxQuant score",177.6400000,0.9999680,,,,2.0484800264774E-29,
HPSITGAPQETDIGGGYR,og,T,57,true,"O-GlcNac Inflorescence Tissue",81,28154133,"MASCOT Score",53.9000000,,,,,,0.3700000
SGYVPTLPDSPK,ph,S,122,true,"STN8 phosphoproteome",38,21768351,"MASCOT Score",50.6400000,,,,,,-0.6144680
SGYVPTLPDSPK,ph,S,122,true,"Large-scale phosphorylation discovery",44,23111157,XCorr,2.9530000,,,,,,
SGYVPTLPDSPK,ph,S,122,true,"Tyrosine phosphorylation in Arabidopsis",59,18463617,"MASCOT Score",44.0000000,,,,,,-0.8957865
SGYVPTLPDSPK,ph,S,122,true,"Chloroplast kinase substrates",60,19376835,"MASCOT Score",45.3200000,,,,,,-0.3461350
SGYVPTLPDSPK,ph,S,122,true,"srk2dei ABA signaling phopshoproteomics",83,23572148,"MASCOT Score",44.0000000,,,,,,0.0002000
SGYVPTLPDSPK,ph,S,122,true,"LAXIC - ABA stress",84a,23660473,XCorr,2.5100000,0.9880000,,,,0.0039986199699342,
SGYVPTLPDSPK,ph,S,122,true,"LAXIC - mannitol vs control",84b,23660473,XCorr,2.6300000,0.9980000,-1.3173277,,NO,0.0072899898514152,
SGYVPTLPDSPK,ph,S,122,true,"SnRK2 protein kinase substrates",85,23776212,XCorr,2.4080312,1.0000000,,,,9.8656499176286E-5,
SGYVPTLPDSPK,ph,S,122,true,"atm and atr DNA damage response",88,25561503,"MASCOT Score",61.0000000,1.0000000,,,,,-0.8200000
SGYVPTLPDSPK,ph,S,122,true,"Brassinosteroid-Regulated Phosphorylation Dynamics",94,26187819,"MaxQuant Score",110.7700000,1.0000000,,,,0.003000000026077,-5.1710000
SGYVPTLPDSPK,ph,S,122,true,"TOR Kinase and ABA Receptor",100,29290610,XCorr,2.5011535,1.0000000,,,,0.0015059999423102,
SGYVPTLPDSPK,ph,S,122,true,"Lateral root-induction - NAA vs control",106,23328941,"MASCOT Score",35.0000000,,,,,,
SGYVPTLPDSPK,ph,S,122,true,"Phospho cell culture sucrose/TOR",109,30833711,,,0.9999970,,,,,
SGYVPTLPDSPK,ph,S,122,true,"Col-0 callus - FC Col-0 vs. Col-0 Xray",111a,31410901,,39.6100000,,-0.0001987,0.0000000,NO,,0.4677629
SGYVPTLPDSPK,ph,S,122,true,"Col-0 X-ray callus - FC Col-0 vs. Col-0 Xray",111b,31410901,,39.6100000,,-0.0001987,0.0000000,NO,,0.4677629
SGYVPTLPDSPK,ph,S,122,true,"atm callus - FC atm vs. atm Xray",111c,31410901,,39.6100000,,0.5843314,0.0000000,NO,,0.4677629
SGYVPTLPDSPK,ph,S,122,true,"atm-3 X-ray callus - FC atm vs. atm Xray",111d,31410901,,39.6100000,,0.5843314,0.0000000,NO,,0.4677629
SGYVPTLPDSPK,ph,S,122,true,"Tissue atlas Arabidopsis - ProteomicsDB",114,32188942,"MaxQuant score",172.2800000,1.0000000,,,,0,
FASGSYLSPSSHGYGQK,ph,S,127,true,"Lateral root-induction - NAA vs control",106,23328941,"MASCOT Score",35.0000000,,,,,,
FASGSYLSPSSHGYGQK,ph,Y,130,true,"srk2dei ABA signaling phopshoproteomics",83,23572148,"MASCOT Score",27.0000000,,,,,,0.0004000
FASGSYLSPSSHGYGQK,ph,S,132,true,"STN8 phosphoproteome",38,21768351,"MASCOT Score",56.0200000,,,,,,-0.2371750
FASGSYLSPSSHGYGQK,ph,S,132,true,"Chloroplast kinase substrates",60,19376835,"MASCOT Score",43.8100000,,,,,,-0.0430846
FASGSYLSPSSHGYGQK,ph,S,132,true,"srk2dei ABA signaling phopshoproteomics",83,23572148,"MASCOT Score",62.0000000,,,,,,-0.0001000
FASGSYLSPSSHGYGQK,ph,S,132,true,"SnRK2 protein kinase substrates",85,23776212,XCorr,3.0391736,0.9390000,,,,0.042519498616457,
FASGSYLSPSSHGYGQK,ph,S,132,true,"atm and atr DNA damage response",88,25561503,"MASCOT Score",49.0000000,0.8230000,,,,,0.6100000
FASGSYLSPSSHGYGQK,ph,S,132,true,"TOR Kinase and ABA Receptor",100,29290610,XCorr,4.5130901,0.9701000,,,,4.1570001485525E-6,
FASGSYLSPSSHGYGQK,ph,S,132,true,"Lateral root-induction - NAA vs control",106,23328941,"MASCOT Score",42.0000000,,,,,,
FASGSYLSPSSHGYGQK,ph,S,132,true,"Phospho cell culture sucrose/TOR",109,30833711,,,0.9956690,,,,,
FASGSYLSPSSHGYGQK,ph,S,132,true,"Col-0 callus - FC Col-0 vs. Col-0 Xray",111a,31410901,,57.8000000,,0.0802394,0.0000000,NO,,0.5660954
FASGSYLSPSSHGYGQK,ph,S,132,true,"Col-0 X-ray callus - FC Col-0 vs. Col-0 Xray",111b,31410901,,57.8000000,,0.0802394,0.0000000,NO,,0.5660954
FASGSYLSPSSHGYGQK,ph,S,132,true,"atm callus - FC atm vs. atm Xray",111c,31410901,,57.8000000,,0.8568786,0.0000000,NO,,0.5660954
FASGSYLSPSSHGYGQK,ph,S,132,true,"atm-3 X-ray callus - FC atm vs. atm Xray",111d,31410901,,57.8000000,,0.8568786,0.0000000,NO,,0.5660954
FASGSYLSPSSHGYGQK,ph,S,132,true,"Tissue atlas Arabidopsis - ProteomicsDB",114,32188942,"MaxQuant score",343.3100000,0.9999250,,,,0,
FASGSYLSPSSHGYGQK,ph,S,134,true,"srk2dei ABA signaling phopshoproteomics",83,23572148,"MASCOT Score",43.0000000,,,,,,0.0009000
FASGSYLSPSSHGYGQK,og,S,135,true,"O-GlcNac Inflorescence Tissue",81,28154133,"MASCOT Score",38.3000000,,,,,,-0.6400000
FASGSYLSPSSHGYGQK,ph,S,135,true,"Tissue atlas Arabidopsis - ProteomicsDB",114,32188942,"MaxQuant score",164.4800000,0.9336630,,,,6.6027000468174E-31,
FASGSYLSPSSHGYGQK,ph,Y,138,true,"srk2dei ABA signaling phopshoproteomics",83,23572148,"MASCOT Score",41.0000000,,,,,,0.0011000
QYGEQSSSYLGR,og,S,165,true,"O-GlcNac Inflorescence Tissue",81,28154133,"MASCOT Score",26.8000000,,,,,,1.6000000
IDQASLLR,ph,S,201,true,"Tissue atlas Arabidopsis - ProteomicsDB",114,32188942,"MaxQuant score",83.8620000,1.0000000,,,,0.0079682599753141,
MQSLHTSSVDAGVNR,ph,S,213,true,"Tissue atlas Arabidopsis - ProteomicsDB",114,32188942,"MaxQuant score",77.5060000,0.9997960,,,,0.00030297099146992,
MQSLHTSSVDAGVNR,ph,S,218,true,"Tissue atlas Arabidopsis - ProteomicsDB",114,32188942,"MaxQuant score",120.0800000,0.7671610,,,,9.9395094821375E-7,
LESDPHGLSVR,ph,S,253,true,"Tissue atlas Arabidopsis - ProteomicsDB",114,32188942,"MaxQuant score",111.7900000,1.0000000,,,,3.2523501431569E-5,
LESDPHGLSVR,ph,S,259,true,"Tissue atlas Arabidopsis - ProteomicsDB",114,32188942,"MaxQuant score",71.2790000,0.9998260,,,,0.0006693999748677,
NTSSYASQHTPSLLGAVPR,ph,T,271,true,"Tissue atlas Arabidopsis - ProteomicsDB",114,32188942,"MaxQuant score",303.7800000,0.9951490,,,,0,
NTSSYASQHTPSLLGAVPR,ph,S,273,true,"Tissue atlas Arabidopsis - ProteomicsDB",114,32188942,"MaxQuant score",180.3100000,0.8292470,,,,4.7735100801481E-36,
GIHSAASLDLDYPGGMLAR,ph,S,318,true,"Tissue atlas Arabidopsis - ProteomicsDB",114,32188942,"MaxQuant score",208.4000000,0.9999940,,,,0,
RSSPIKPIR,ph,S,474,true,"Tyrosine phosphorylation in Arabidopsis",59,18463617,"MASCOT Score",24.0000000,,,,,,-1.2360828
RSSPIKPIR,ph,S,474,true,"srk2dei ABA signaling phopshoproteomics",83,23572148,"MASCOT Score",31.0000000,,,,,,0.0004000
RSSPIKPIR,ph,S,474,true,"SnRK2 protein kinase substrates",85,23776212,XCorr,2.1977565,0.9880000,,,,0.064658097922802,
RSSPIKPIR,ph,S,474,true,"Tissue atlas Arabidopsis - ProteomicsDB",114,32188942,"MaxQuant score",61.4800000,0.9616840,,,,0.010236999951303,
LHLDLSNCR,so,C,654,true,"Arabidopsis S-sulfenylation chemoproteomics",108,31578252,"pFind PSM Score",0.0320700,,1.0101000,,,,0.3244501
LLSQEVK,ph,S,716,true,"Tissue atlas Arabidopsis - ProteomicsDB",114,32188942,"MaxQuant score",154.0100000,1.0000000,,,,0.014293500222266,
DAEKKSPGDTSGTPTTGTK,ph,S,734,true,"SnRK2 protein kinase substrates",85,23776212,XCorr,2.2864304,0.9800000,,,,2.5934400582628E-7,
KSPGDTSGTPTTGTK,ph,S,734,true,"Large-scale phosphorylation discovery",44,23111157,XCorr,2.2850000,,,,,,
KSPGDTSGTPTTGTK,ph,S,734,true,"atm and atr DNA damage response",88,25561503,"MASCOT Score",75.0000000,1.0000000,,,,,-0.9400000
KSPGDTSGTPTTGTK,ph,S,734,true,"TOR Kinase and ABA Receptor",100,29290610,XCorr,3.5802636,1.0000000,,,,9.7259999165544E-6,
KSPGDTSGTPTTGTK,ph,S,734,true,"Phospho cell culture sucrose/TOR",109,30833711,,,0.9999940,,,,,
SPGDTSGTPTTGTKK,ph,S,734,true,"Chloroplast kinase substrates",60,19376835,"MASCOT Score",44.8400000,,,,,,-0.6013020
SPGDTSGTPTTGTKK,ph,S,734,true,"Tissue atlas Arabidopsis - ProteomicsDB",114,32188942,"MaxQuant score",245.6200000,1.0000000,,,,0,
SPGDTSGTPTTGTK,ph,S,734,true,"STN8 phosphoproteome",38,21768351,"MASCOT Score",61.4300000,,,,,,-0.9184170
SPGDTSGTPTTGTK,ph,S,734,true,"Chloroplast kinase substrates",60,19376835,"MASCOT Score",46.1900000,,,,,,0.2058380
SPGDTSGTPTTGTK,ph,S,734,true,"SnRK2 protein kinase substrates",85,23776212,XCorr,2.4186575,0.9980000,,,,0.089636698365211,
SPGDTSGTPTTGTK,ph,S,734,true,"atm and atr DNA damage response",88,25561503,"MASCOT Score",84.0000000,1.0000000,,,,,-0.3600000
SPGDTSGTPTTGTK,ph,S,734,true,"TOR Kinase and ABA Receptor",100,29290610,XCorr,3.7285058,0.9925000,,,,0.00040849999641068,
SPGDTSGTPTTGTK,ph,T,741,true,"atm and atr DNA damage response",88,25561503,"MASCOT Score",41.0000000,0.8500000,,,,,-0.9800000
SPGDTSGTPTTGTK,ph,T,741,true,"Tissue atlas Arabidopsis - ProteomicsDB",114,32188942,"MaxQuant score",130.2300000,0.9528920,,,,0.00010081999789691,
KVAETGDTSDPSAK,ph,T,812,true,"Tissue atlas Arabidopsis - ProteomicsDB",114,32188942,"MaxQuant score",152.1100000,0.7562140,,,,3.1866301242189E-7,
VAETGDTSDPSAK,ph,T,812,true,"atm and atr DNA damage response",88,25561503,"MASCOT Score",58.0000000,0.9610000,,,,,0.1900000
SSDSGSVEMKPTAESLEDVKDENASK,ph,S,876,true,"Tissue atlas Arabidopsis - ProteomicsDB",114,32188942,"MaxQuant score",135.7000000,0.9954650,,,,1.9141737022677E-42,
SSDSGSVEMKPTAESLEDVK,ph,S,876,true,"TOR Kinase and ABA Receptor",100,29290610,XCorr,2.8177760,0.9828000,,,,3.6990000808146E-5,
TVDVKQETGSPDTK,ph,T,904,true,"Tissue atlas Arabidopsis - ProteomicsDB",114,32188942,"MaxQuant score",127.3200000,0.7502390,,,,1.6871099433047E-5,
TVDVKQETGSPDTK,ph,S,906,true,"STN8 phosphoproteome",38,21768351,"MASCOT Score",46.6100000,,,,,,-0.0424932
TVDVKQETGSPDTK,ph,S,906,true,"SnRK2 protein kinase substrates",85,23776212,XCorr,2.5422108,0.9930000,,,,0.018722899258137,
TVDVKQETGSPDTK,ph,S,906,true,"Tissue atlas Arabidopsis - ProteomicsDB",114,32188942,"MaxQuant score",294.9400000,0.9998630,,,,0,
QETGSPDTK,ph,S,906,true,"SnRK2 protein kinase substrates",85,23776212,XCorr,2.1130064,0.9810000,,,,0.019049799069762,
QETGSPDTK,ph,S,906,true,"atm and atr DNA damage response",88,25561503,"MASCOT Score",51.0000000,1.0000000,,,,,-0.9700000
NNSETMSEGKK,ph,S,941,true,"atm and atr DNA damage response",88,25561503,"MASCOT Score",29.0000000,0.9050000,,,,,-1.7100000
QDGGTSDAAKR,ph,T,1261,true,"atm and atr DNA damage response",88,25561503,"MASCOT Score",38.0000000,0.9420000,,,,,0.6700000
