Peptide,PTM,ModifiedAA,ModifiedPosition,PeptideUniqueToGene,ExperimentDesc,ExpID,PubmedID,ScoreType,IdentScore,LocProb,Log2FChange,PQ-val,QuantSig,PEP,MassErrorPPM
KLMEPSKTLNMSINPK,ph,T,55,true,"Tissue atlas Arabidopsis - ProteomicsDB",114,32188942,"MaxQuant score",57.9850000,0.9858350,,,,0.00089861400192603,
LVNSCNSSFKEK,ph,S,152,true,"Tissue atlas Arabidopsis - ProteomicsDB",114,32188942,"MaxQuant score",144.1800000,0.9999980,,,,1.114649990086E-6,
LVNSCNSSFKEK,ph,S,155,true,"atm and atr DNA damage response",88,25561503,"MASCOT Score",21.0000000,1.0000000,,,,,-2.3500000
LVNSCNSSFK,ph,S,155,true,"Tissue atlas Arabidopsis - ProteomicsDB",114,32188942,"MaxQuant score",150.3300000,0.7726700,,,,8.4873698824595E-7,
LVNSCNSSFKEK,ph,S,156,true,"atm and atr DNA damage response",88,25561503,"MASCOT Score",34.0000000,0.9970000,,,,,-0.9400000
LVNSCNSSFKEK,ph,S,156,true,"Tissue atlas Arabidopsis - ProteomicsDB",114,32188942,"MaxQuant score",144.1800000,0.9695590,,,,1.114649990086E-6,
LVNSCNSSFK,ph,S,156,true,"atm and atr DNA damage response",88,25561503,"MASCOT Score",52.0000000,0.9520000,,,,,-0.4100000
SFLANLGCK,acy,C,183,true,"Arabidopsis S-acylation atlas - Hypocotyl",163b,35681017,,,,,,,,
SFLANLGCK,acy,C,183,true,"Arabidopsis S-acylation atlas - Leaf",163c,35681017,,,,,,,,
SSADMNTELIK,ph,S,217,true,"atm and atr DNA damage response",88,25561503,"MASCOT Score",43.0000000,0.9980000,,,,,-1.6500000
SSADMNTELIK,ph,S,217,true,"Tissue atlas Arabidopsis - ProteomicsDB",114,32188942,"MaxQuant score",120.9600000,0.7821510,,,,6.602730081795E-6,
SLEVFGSPVAIEK,ph,S,238,true,"atm and atr DNA damage response",88,25561503,"MASCOT Score",62.0000000,1.0000000,,,,,-0.3500000
SLEVFGSPVAIEK,ph,S,238,true,"Tissue atlas Arabidopsis - ProteomicsDB",114,32188942,"MaxQuant score",142.1000000,1.0000000,,,,3.0175599476934E-6,
SLEVFGSPVAIEK,ph,S,244,true,"STN8 phosphoproteome",38,21768351,"MASCOT Score",87.5400000,,,,,,-0.9709360
SLEVFGSPVAIEK,ph,S,244,true,"atm and atr DNA damage response",88,25561503,"MASCOT Score",62.0000000,1.0000000,,,,,-0.3500000
SLEVFGSPVAIEK,ph,S,244,true,"TOR Kinase and ABA Receptor",100,29290610,XCorr,4.5965300,1.0000000,,,,1.1839999842778E-6,
SLEVFGSPVAIEK,ph,S,244,true,"Tissue atlas Arabidopsis - ProteomicsDB",114,32188942,"MaxQuant score",202.2500000,1.0000000,,,,1.1700099488926E-38,
SLEVFGSPVAIEK,ph,S,244,true,"Touch-induced phosphorylation: 40s touch vs untouc",136,30291188,"MASCOT score",60.2900000,,0.1898970,0.6803076,NO,,5.9232718
SSSSSGGNGFLMSCK,ph,S,365,true,"atm and atr DNA damage response",88,25561503,"MASCOT Score",29.0000000,1.0000000,,,,,-0.5200000
