Peptide,PTM,ModifiedAA,ModifiedPosition,PeptideUniqueToGene,ExperimentDesc,ExpID,PubmedID,ScoreType,IdentScore,LocProb,Log2FChange,PQ-val,QuantSig,PEP,MassErrorPPM
GNCLDSSAK,myr,G,2,false,"N-Terminal Myristoylated Proteins",102,29453228,,,,,,,,
VDSSSHSPHANSASLSSR,ph,S,14,true,"Tissue atlas Arabidopsis - ProteomicsDB",114,32188942,"MaxQuant score",139.6900000,0.7848840,,,,1.2829499832293E-15,
VDSSSHSPHANSASLSSR,ph,S,15,true,"Tissue atlas Arabidopsis - ProteomicsDB",114,32188942,"MaxQuant score",109.8700000,0.9504510,,,,1.509239955233E-9,
VDSSSHSPHANSASLSSR,ph,S,17,true,"atm and atr DNA damage response",88,25561503,"MASCOT Score",45.0000000,0.9990000,,,,,0.4200000
VDSSSHSPHANSASLSSR,ph,S,17,true,"Tissue atlas Arabidopsis - ProteomicsDB",114,32188942,"MaxQuant score",176.6500000,0.9975890,,,,5.244399923945E-29,
VDSSSHSPHANSASLSSR,ph,S,22,true,"Tissue atlas Arabidopsis - ProteomicsDB",114,32188942,"MaxQuant score",132.3900000,0.9272340,,,,4.7685100429385E-15,
VDSSSHSPHANSASLSSR,ph,S,24,true,"Tissue atlas Arabidopsis - ProteomicsDB",114,32188942,"MaxQuant score",180.7000000,0.7845560,,,,5.2475900225841E-36,
STVPSSLSINSYSSVESLPTPR,ph,S,43,true,"Tissue atlas Arabidopsis - ProteomicsDB",114,32188942,"MaxQuant score",128.3800000,0.9894920,,,,1.6189999607388E-21,
STVPSSLSINSYSSVESLPTPR,ph,S,52,true,"Tissue atlas Arabidopsis - ProteomicsDB",114,32188942,"MaxQuant score",105.2200000,0.9035930,,,,3.802650035134E-12,
STVPSSLSINSYSSVESLPTPR,ph,T,55,true,"Tissue atlas Arabidopsis - ProteomicsDB",114,32188942,"MaxQuant score",105.3200000,0.9969380,,,,9.8346599960997E-12,
TEGEILSSPNLK,ph,S,64,false,"Tissue atlas Arabidopsis - ProteomicsDB",114,32188942,"MaxQuant score",157.5600000,0.9052660,,,,8.9844198747357E-10,
TEGEILSSPNLK,ph,S,65,false,"Tissue atlas Arabidopsis - ProteomicsDB",114,32188942,"MaxQuant score",188.1500000,0.9506550,,,,1.7470300106364E-20,
NFRPDSLLGEGGFGYVFK,ph,S,87,true,"TOR Kinase and ABA Receptor",100,29290610,XCorr,4.2019386,1.0000000,,,,1.5610000048127E-7,
NFRPDSLLGEGGFGYVFK,ph,S,87,true,"Tissue atlas Arabidopsis - ProteomicsDB",114,32188942,"MaxQuant score",172.2400000,1.0000000,,,,1.8754499723939E-27,
GWIDGTTLTASKPGSGIVVAVK,ph,S,114,true,"Phosphorylation Early Elicitor Signaling",23,17317660,,,,,,,,
GWIDGTTLTASKPGSGIVVAVK,ph,S,114,true,"Phospho cell culture sucrose/TOR",109,30833711,,,0.8013080,,,,,
PGSGIVVAVK,ph,S,114,false,"atm and atr DNA damage response",88,25561503,"MASCOT Score",57.0000000,1.0000000,,,,,-1.7800000
PGSGIVVAVK,ph,S,114,false,"Tissue atlas Arabidopsis - ProteomicsDB",114,32188942,"MaxQuant score",305.6100000,1.0000000,,,,0,
EWLTEVNYLGQLSHPNLVKLVGYCVEGENR,ph,T,136,true,"SnRK2 protein kinase substrates",85,23776212,XCorr,3.2975879,0.7500000,,,,0.2497850060463,
EWLTEVNYLGQLSHPNLVKLVGYCVEGENR,ph,Y,140,true,"SnRK2 protein kinase substrates",85,23776212,XCorr,3.2975879,0.7500000,,,,0.2497850060463,
EWLTEVNYLGQLSHPNLVKLVGYCVEGENR,ph,S,145,true,"SnRK2 protein kinase substrates",85,23776212,XCorr,3.2975879,0.7500000,,,,0.2497850060463,
EWLTEVNYLGQLSHPNLVKLVGYCVEGENR,ph,Y,155,true,"SnRK2 protein kinase substrates",85,23776212,XCorr,3.2975879,0.7500000,,,,0.2497850060463,
QAQIDSPR,ph,S,384,true,"atm and atr DNA damage response",88,25561503,"MASCOT Score",38.0000000,1.0000000,,,,,-0.1500000
GSNGSIVQKSPR,ph,S,396,true,"atm and atr DNA damage response",88,25561503,"MASCOT Score",43.0000000,1.0000000,,,,,-0.0500000
GSNGSIVQKSPR,ph,S,396,true,"Tissue atlas Arabidopsis - ProteomicsDB",114,32188942,"MaxQuant score",115.5800000,1.0000000,,,,8.2931903307326E-5,
YSYDRPLLHITPGASPLPTHNHSPR,ph,S,414,true,"Tissue atlas Arabidopsis - ProteomicsDB",114,32188942,"MaxQuant score",117.6000000,0.9990640,,,,1.7998900324657E-22,
RYSYDRPLLHITPGASPLPTHNHSPR,ph,T,418,true,"Tissue atlas Arabidopsis - ProteomicsDB",114,32188942,"MaxQuant score",83.2930000,0.8272280,,,,1.3065900358183E-12,
YSYDRPLLHITPGASPLPTHNHSPR,ph,S,422,true,"Tissue atlas Arabidopsis - ProteomicsDB",114,32188942,"MaxQuant score",136.9100000,0.9981320,,,,2.1972899454153E-35,
