Peptide,PTM,ModifiedAA,ModifiedPosition,PeptideUniqueToGene,ExperimentDesc,ExpID,PubmedID,ScoreType,IdentScore,LocProb,Log2FChange,PQ-val,QuantSig,PEP,MassErrorPPM
ANLQVSGILEKFQMTGK,nta,A,2,true,"Arabidopsis translation initiation landscape - NTA",167a,35069635,,,,,,,,
ANLQVSGILEK,nta,A,2,true,"Characterization plant N-terminal acetylation",6,22223895,"MASCOT Score",81.8500000,,,,,,
ANLQVSGILE,nta,A,2,true,"HUNTER N-terminome: legumain, GluC and trypsin",119,31951383,"MaxQuant score",144.0900000,,,,,,
CLAPLVK,so,C,71,true,"Arabidopsis S-sulfenylation chemoproteomics",108,31578252,"pFind PSM Score",0.1951700,,,,,,-1.1949262
CLAPLVK,so,C,71,true,"S-sulfenylation site detection using YAP1C",110,32714340,,,,,,,,
TVTCIASLASSLSDDLLAK,so,C,194,true,"S-sulfenylation site detection using YAP1C",110,32714340,,,,,,,,
NAKSEITR,ac,K,224,true,"Quantitative Acetylproteomics",101,29440448,,,,,,,,
NAKSEITR,ub,K,224,true,"Arabidopsis ubiquitination COFRADIC",40,26744219,"MaxQuant Score",78.5160000,1.0000000,,,,0.026000000536442,1.1520000
TNIQMIGALCR,ox,C,239,true,"SPEAR - 10 mM H2O2 / mock",138a,34619326,,,,2.1593555,0.0309485,YES,,
TNIQMIGALCR,so,C,239,true,"Arabidopsis S-sulfenylation chemoproteomics",108,31578252,"pFind PSM Score",0.0002213,,1.0150200,,,,-0.5153384
TNIQMIGALCR,so,C,239,true,"S-sulfenylation site detection using YAP1C",110,32714340,,,,,,,,
CLAGLIVSR,so,C,353,true,"S-sulfenylation site detection using YAP1C",110,32714340,,,,,,,,
VYQEACPK,ox,C,373,true,"OxiTRAQ Arabidopsis - 5 mM H2O2 versus control",47,24376095,,,,0.1959219,0.3692312,NO,,
VYQEACPK,sno,C,373,true,"hot5-4 / wildtype, FAT-switch S-nitrosoproteome",169,37277371,,,,0.7310148,0.0003584,YES,,
VYQEACPK,so,C,373,true,"Arabidopsis S-sulfenylation chemoproteomics",108,31578252,"pFind PSM Score",0.1394420,,0.9753800,,,,-1.0142520
QEVSKIVK,ac,K,427,true,"Histone deacetylases - apicidin vs control",98a,29061669,"MaxQuant Score",115.7000000,1.0000000,0.0100000,0.9727472,NO,0.0040000001899898,
SSPVLAAVGER,nt,S,514,true,"Arabidopsis translation initiation landscape - NT",167b,35069635,,,,,,,,
VCGELVR,sno,C,536,true,"hot5-4 / wildtype, FAT-switch S-nitrosoproteome",169,37277371,,,,0.3972148,0.0575454,NO,,
VTAEALRVCGELVR,so,C,536,true,"Arabidopsis S-sulfenylation chemoproteomics",108,31578252,"pFind PSM Score",0.1734370,,1.0761700,,,,-1.7515654
VCGELVR,so,C,536,true,"S-sulfenylation site detection using YAP1C",110,32714340,,,,,,,,
AELPSCLPVLVDR,sno,C,604,true,"hot5-4 / wildtype, FAT-switch S-nitrosoproteome",169,37277371,,,,0.3743960,0.0204206,NO,,
AELPSCLPVLVDR,so,C,604,true,"S-sulfenylation site detection using YAP1C",110,32714340,,,,,,,,
SCSENISLAVR,sno,C,718,true,"hot5-4 / wildtype, FAT-switch S-nitrosoproteome",169,37277371,,,,0.5570278,0.0012579,NO,,
NCSSTVK,sno,C,810,true,"hot5-4 / wildtype, FAT-switch S-nitrosoproteome",169,37277371,,,,,,,,
ILALLFNHCESEEEGVR,so,C,940,true,"Arabidopsis S-sulfenylation chemoproteomics",108,31578252,"pFind PSM Score",0.0075245,,4.6296300,,,,-1.3806787
NVVAECLGK,sno,C,954,true,"hot5-4 / wildtype, FAT-switch S-nitrosoproteome",169,37277371,,,,1.0018902,0.0112546,YES,,
NVVAECLGK,so,C,954,true,"Arabidopsis S-sulfenylation chemoproteomics",108,31578252,"pFind PSM Score",0.2105890,,0.9345800,,,,0.2417741
NVVAECLGK,so,C,954,true,"S-sulfenylation site detection using YAP1C",110,32714340,,,,,,,,
INGVDYSHKFK,ac,K,1195,true,"Quantitative Acetylproteomics",101,29440448,,,,,,,,
