Peptide,PTM,ModifiedAA,ModifiedPosition,PeptideUniqueToGene,ExperimentDesc,ExpID,PubmedID,ScoreType,IdentScore,LocProb,Log2FChange,PQ-val,QuantSig,PEP,MassErrorPPM
SSSTGFDNSNVVVKE,nt,S,62,true,"N-terminal ChaFRADIC",92,26010716,"MASCOT Score",77.2400000,,,,,7.5010000728071E-5,
SSSTGFDNSNVVVKE,nt,S,62,true,"Arg/N-end rule seed, prt6 vs. Wt",99,29168982,"MASCOT Score",69.7900000,,0.1983075,0.1019526,NO,9.5450003456676E-9,-1.2266393
SSSTGFDNSNVVVKE,nt,S,62,true,"HUNTER N-terminome: legumain, GluC and trypsin",119,31951383,"MaxQuant score",145.5200000,,,,,,
SSSTGFDNSNVVVKE,nta,S,62,true,"N-terminal ChaFRADIC",92,26010716,"MASCOT Score",77.2400000,,,,,7.5010000728071E-5,
SSSTGFDNSNVVVKE,nta,S,62,true,"HUNTER N-terminome: legumain, GluC and trypsin",119,31951383,"MaxQuant score",194.2400000,,,,,,
SSSTGFDNSNVVVKE,nta,S,62,true,"Arabidopsis translation initiation landscape - NTA",167a,35069635,,,,,,,,
SSSTGFDNSNVVVK,nta,S,62,true,"Characterization plant N-terminal acetylation",6,22223895,"MASCOT Score",89.5000000,,,,,,
SSTGFDNSNVVVKE,nt,S,63,true,"Arg/N-end rule seed, prt6 vs. Wt",99,29168982,"MASCOT Score",65.6700000,,-0.1356698,0.1608574,NO,1.1749999657695E-6,-1.7357267
QDSVYSGLQEIDVNSELVCIHDSAR,nt,Q,158,true,"HUNTER N-terminome: legumain, GluC and trypsin",119,31951383,"MaxQuant score",62.5820000,,,,,,
DGSAVGAAVLGVPAKATIK,ph,T,212,true,"Tissue atlas Arabidopsis - ProteomicsDB",114,32188942,"MaxQuant score",211.1300000,1.0000000,,,,0,
ATIKEVNSDSLVVK,ph,T,212,true,"Phospho cell culture sucrose/TOR",109,30833711,,,0.9999920,,,,,
