Peptide,PTM,ModifiedAA,ModifiedPosition,PeptideUniqueToGene,ExperimentDesc,ExpID,PubmedID,ScoreType,IdentScore,LocProb,Log2FChange,PQ-val,QuantSig,PEP,MassErrorPPM
DPGTTSSWK,ph,S,35,false,"Tissue atlas Arabidopsis - ProteomicsDB",114,32188942,"MaxQuant score",179.5700000,0.7658910,,,,1.0923199624813E-6,
DPGTTSSWKSPLDSSR,ph,S,39,true,"Tissue atlas Arabidopsis - ProteomicsDB",114,32188942,"MaxQuant score",176.6700000,0.9907300,,,,1.2399800081481E-20,
SVALLETPASR,ph,S,46,true,"Tissue atlas Arabidopsis - ProteomicsDB",114,32188942,"MaxQuant score",130.4700000,1.0000000,,,,0.0001397879968863,
SVALLETPASR,ph,T,52,true,"Tissue atlas Arabidopsis - ProteomicsDB",114,32188942,"MaxQuant score",150.1400000,0.9903070,,,,4.8874401414878E-8,
SVALLETPASR,ph,S,55,true,"Tissue atlas Arabidopsis - ProteomicsDB",114,32188942,"MaxQuant score",145.3100000,0.9628740,,,,3.901120138039E-8,
NGKEEEEEEEDASSWTQASVNDDDDVSDAR,ph,S,114,true,"Phytohormone-responsive phosphoproteins",34,20374526,"MASCOT Score",67.0000000,,,,,,6.9156000
EIQSASMGFR,ph,S,144,true,"Tissue atlas Arabidopsis - ProteomicsDB",114,32188942,"MaxQuant score",123.0100000,0.9829600,,,,0.00011461700341897,
ISSSRLDCLSK,ph,S,181,true,"Tissue atlas Arabidopsis - ProteomicsDB",114,32188942,"MaxQuant score",98.3370000,0.8200940,,,,0.00017926600412466,
LDCLSK,ox,C,185,true,"OxiTRAQ Arabidopsis - 5 mM H2O2 versus control",47,24376095,,,,0.6343883,0.0074291,YES,,
NCNAGSDDTEEELSNSEDLRK,ph,S,204,true,"Tissue atlas Arabidopsis - ProteomicsDB",114,32188942,"MaxQuant score",154.8800000,1.0000000,,,,0,
KVTGASPLLLK,ph,T,221,true,"Tissue atlas Arabidopsis - ProteomicsDB",114,32188942,"MaxQuant score",102.8700000,0.7628950,,,,0.0001540590019431,
KVTGASPLLLK,ph,S,224,true,"atm and atr DNA damage response",88,25561503,"MASCOT Score",60.0000000,1.0000000,,,,,-1.2100000
VTGASPLLLK,ph,S,224,true,"STN8 phosphoproteome",38,21768351,"MASCOT Score",55.5600000,,,,,,-0.3458530
VTGASPLLLK,ph,S,224,true,"srk2dei ABA signaling phopshoproteomics",83,23572148,"MASCOT Score",25.0000000,,,,,,-0.0020000
VTGASPLLLK,ph,S,224,true,"TOR Kinase and ABA Receptor",100,29290610,XCorr,4.0328274,1.0000000,,,,3.0610000976594E-5,
VTGASPLLLK,ph,S,224,true,"Tissue atlas Arabidopsis - ProteomicsDB",114,32188942,"MaxQuant score",158.0200000,1.0000000,,,,1.3823600042429E-8,
SCCSPSFSDTLR,ph,S,329,false,"Tissue atlas Arabidopsis - ProteomicsDB",114,32188942,"MaxQuant score",198.8100000,0.9999920,,,,5.9809298979032E-25,
SCCSPSFSDTLR,ph,S,333,false,"Tissue atlas Arabidopsis - ProteomicsDB",114,32188942,"MaxQuant score",198.8100000,0.9949000,,,,5.9809298979032E-25,
TGSSILCGSQSVYR,ph,S,341,true,"Tissue atlas Arabidopsis - ProteomicsDB",114,32188942,"MaxQuant score",290.1700000,0.9596770,,,,0,
TGSSILCGSQSVYRR,ph,S,347,true,"Tissue atlas Arabidopsis - ProteomicsDB",114,32188942,"MaxQuant score",135.2900000,0.9980730,,,,2.486980008598E-7,
SAQGVLPLLSYGGDGR,ph,S,371,true,"atm and atr DNA damage response",88,25561503,"MASCOT Score",24.0000000,1.0000000,,,,,0.9600000
SAQGVLPLLSYGGDGR,ph,S,371,true,"Tissue atlas Arabidopsis - ProteomicsDB",114,32188942,"MaxQuant score",79.9200000,0.8545510,,,,0.00032488201395608,
SAQGVLPLLSYGGDGR,ph,S,380,true,"Tissue atlas Arabidopsis - ProteomicsDB",114,32188942,"MaxQuant score",83.4670000,0.8434410,,,,0.00026483400142752,
SQDGLEAVALDGEEEEGSTPETIR,ph,S,443,true,"Phosphorylation Early Elicitor Signaling",23,17317660,,,,,,,,
RQSSRATDDDPASVSR,ph,S,817,true,"Tissue atlas Arabidopsis - ProteomicsDB",114,32188942,"MaxQuant score",67.0100000,0.9999980,,,,0.002402629936114,
RQSSRATDDDPASVSR,ph,S,818,true,"Tissue atlas Arabidopsis - ProteomicsDB",114,32188942,"MaxQuant score",67.0100000,0.9999970,,,,0.002402629936114,
ATDDDPASVSR,ph,T,821,true,"Tissue atlas Arabidopsis - ProteomicsDB",114,32188942,"MaxQuant score",67.0100000,0.9999930,,,,0.002402629936114,
IGGLHFSKSASPASVIK,ph,S,845,true,"Plasmamembrane phosphorylation",20,15308754,,,,,,,,
IGGLHFSKSASPASVIK,ph,S,845,true,"Phosphorylation Early Elicitor Signaling",23,17317660,,,,,,,,
IGGLHFSK,ph,S,845,true,"atm and atr DNA damage response",88,25561503,"MASCOT Score",35.0000000,1.0000000,,,,,-2.2700000
IGGLHFSK,ph,S,845,true,"Tissue atlas Arabidopsis - ProteomicsDB",114,32188942,"MaxQuant score",137.2800000,1.0000000,,,,0.0024910499341786,
IGGLHFSKSASPASVIK,ph,S,847,true,"Plasmamembrane phosphorylation",20,15308754,,,,,,,,
IGGLHFSKSASPASVIK,ph,S,847,true,"Phosphorylation Early Elicitor Signaling",23,17317660,,,,,,,,
SASPASVIKR,ph,S,847,true,"Tissue atlas Arabidopsis - ProteomicsDB",114,32188942,"MaxQuant score",61.2350000,0.9999840,,,,0.0082723200321198,
IGGLHFSKSASPASVIK,ph,S,849,true,"Plasmamembrane phosphorylation",20,15308754,,,,,,,,
IGGLHFSKSASPASVIK,ph,S,849,true,"Phosphorylation Early Elicitor Signaling",23,17317660,,,,,,,,
SASPASVIK,ph,S,849,true,"Phosphorylation Early Elicitor Signaling",23,17317660,,,,,,,,
SASPASVIK,ph,S,849,true,"atm and atr DNA damage response",88,25561503,"MASCOT Score",39.0000000,0.9940000,,,,,-1.3900000
SASPASVIK,ph,S,849,true,"Tissue atlas Arabidopsis - ProteomicsDB",114,32188942,"MaxQuant score",171.7600000,0.9999750,,,,4.4409598558559E-6,
SASPASVIKR,ph,S,852,true,"Tissue atlas Arabidopsis - ProteomicsDB",114,32188942,"MaxQuant score",102.8700000,0.9999980,,,,0.00025762998848222,
SGHLNNIAGLNAETDVEVGSSVESR,ph,T,1023,true,"Tissue atlas Arabidopsis - ProteomicsDB",114,32188942,"MaxQuant score",119.9900000,0.9999990,,,,2.24024999281E-27,
IESIIR,ph,S,1044,true,"Phosphorylation Early Elicitor Signaling",23,17317660,,,,,,,,
LETAWLQTADKDTPGSIIR,ph,T,1063,true,"Tissue atlas Arabidopsis - ProteomicsDB",114,32188942,"MaxQuant score",327.3100000,0.9999850,,,,0,
DTPGSIIR,ph,S,1066,true,"Tissue atlas Arabidopsis - ProteomicsDB",114,32188942,"MaxQuant score",237.1400000,0.9992220,,,,0,
GQHCPLSPSLLHDTNFGNNK,ph,S,1137,true,"TOR Kinase and ABA Receptor",100,29290610,XCorr,2.0280337,0.8617000,,,,0.0020910000894219,
GQHCPLSPSLLHDTNFGNNK,ph,S,1137,true,"Tissue atlas Arabidopsis - ProteomicsDB",114,32188942,"MaxQuant score",226.5900000,0.9998000,,,,0,
DNLGGYESGSGR,ph,S,1158,true,"atm and atr DNA damage response",88,25561503,"MASCOT Score",54.0000000,0.9490000,,,,,0.5500000
DNLGGYESGSGR,ph,S,1158,true,"Tissue atlas Arabidopsis - ProteomicsDB",114,32188942,"MaxQuant score",159.1200000,0.7918780,,,,4.6423701969754E-34,
