Peptide,PTM,ModifiedAA,ModifiedPosition,PeptideUniqueToGene,ExperimentDesc,ExpID,PubmedID,ScoreType,IdentScore,LocProb,Log2FChange,PQ-val,QuantSig,PEP,MassErrorPPM
TQVTSSGGGFSPGKLR,ph,S,19,true,"Chloroplast kinase substrates",60,19376835,"MASCOT Score",37.1200000,,,,,,2.1020500
TQVTSSGGGFSPGKLR,ph,S,19,true,"Touch-induced phosphorylation: 40s touch vs untouc",136,30291188,"MASCOT score",93.6600000,,-0.3640459,0.7351906,NO,,5.1276998
TQVTSSGGGFSPGK,ph,S,19,true,"Phosphorylation Early Elicitor Signaling",23,17317660,,,,,,,,
TQVTSSGGGFSPGK,ph,S,19,true,"STN8 phosphoproteome",38,21768351,"MASCOT Score",79.3900000,,,,,,-1.3809600
TQVTSSGGGFSPGK,ph,S,19,true,"Chloroplast kinase substrates",60,19376835,"MASCOT Score",77.5500000,,,,,,-0.7769120
TQVTSSGGGFSPGK,ph,S,19,true,"Conserved plant phosphoproteome - Arabidopsis",61a,20466843,"MASCOT Score",64.0000000,1.0000000,,,,,
TQVTSSGGGFSPGK,ph,S,19,true,"srk2dei ABA signaling phopshoproteomics",83,23572148,"MASCOT Score",46.0000000,,,,,,-0.0012000
TQVTSSGGGFSPGK,ph,S,19,true,"LAXIC - ABA stress",84a,23660473,XCorr,2.9500000,1.0000000,,,,0.031941000372171,
TQVTSSGGGFSPGK,ph,S,19,true,"atm and atr DNA damage response",88,25561503,"MASCOT Score",90.0000000,1.0000000,,,,,-1.2500000
TQVTSSGGGFSPGK,ph,S,19,true,"Protein sumoylation and phosphorylation cross-talk",97,28419593,,,,,,,,
TQVTSSGGGFSPGK,ph,S,19,true,"TOR Kinase and ABA Receptor",100,29290610,XCorr,4.2407694,0.9999000,,,,5.2270002015575E-6,
TQVTSSGGGFSPGK,ph,S,19,true,"Lateral root-induction - NAA vs control",106,23328941,"MASCOT Score",47.0000000,,,,,,
TQVTSSGGGFSPGK,ph,S,19,true,"Phospho cell culture sucrose/TOR",109,30833711,,,0.9999980,,,,,
TQVTSSGGGFSPGK,ph,S,19,true,"Col-0 callus - FC Col-0 vs. Col-0 Xray",111a,31410901,,46.2000000,,-0.5952559,0.0000000,NO,,0.3432045
TQVTSSGGGFSPGK,ph,S,19,true,"Col-0 X-ray callus - FC Col-0 vs. Col-0 Xray",111b,31410901,,46.2000000,,-0.5952559,0.0000000,NO,,0.3432045
TQVTSSGGGFSPGK,ph,S,19,true,"atm callus - FC atm vs. atm Xray",111c,31410901,,46.2000000,,-0.4748134,0.0000000,NO,,0.3432045
TQVTSSGGGFSPGK,ph,S,19,true,"atm-3 X-ray callus - FC atm vs. atm Xray",111d,31410901,,46.2000000,,-0.4748134,0.0000000,NO,,0.3432045
TQVTSSGGGFSPGK,ph,S,19,true,"Tissue atlas Arabidopsis - ProteomicsDB",114,32188942,"MaxQuant score",268.1600000,1.0000000,,,,0,
SGSNQIDDPR,ph,S,49,true,"Tissue atlas Arabidopsis - ProteomicsDB",114,32188942,"MaxQuant score",115.9200000,0.9891200,,,,0.00018155100406148,
DVDVVSEITDCSTSGIAR,ph,S,73,true,"Tissue atlas Arabidopsis - ProteomicsDB",114,32188942,"MaxQuant score",136.2600000,0.9999590,,,,8.6501201565316E-17,
SISLGLQEYSDYDNVNEIK,ph,S,86,true,"SnRK2 protein kinase substrates",85,23776212,XCorr,3.5459905,0.9360000,,,,7.8340697484691E-8,
SISLGLQEYSDYDNVNEIK,ph,S,86,true,"TOR Kinase and ABA Receptor",100,29290610,XCorr,4.3563519,0.8724000,,,,1.2600000445673E-5,
SISLGLQEYSDYDNVNEIK,ph,S,88,true,"Phospho cell culture sucrose/TOR",109,30833711,,,0.9701670,,,,,
SISLGLQEYSDYDNVNEIK,ph,S,88,true,"Tissue atlas Arabidopsis - ProteomicsDB",114,32188942,"MaxQuant score",206.5900000,0.9987720,,,,0,
SFSKPAPSK,ph,S,130,true,"Tissue atlas Arabidopsis - ProteomicsDB",114,32188942,"MaxQuant score",106.2900000,0.9954260,,,,0.0012173600262031,
SFSKPAPSK,ph,S,132,true,"atm and atr DNA damage response",88,25561503,"MASCOT Score",49.0000000,0.9990000,,,,,-2.1400000
SFSKPAPSK,ph,S,132,true,"Phospho cell culture sucrose/TOR",109,30833711,,,0.9999250,,,,,
SFSKPAPSK,ph,S,132,true,"Tissue atlas Arabidopsis - ProteomicsDB",114,32188942,"MaxQuant score",180.8000000,0.9999970,,,,1.6067199675394E-25,
WIASPTANRPK,ph,S,148,true,"atm and atr DNA damage response",88,25561503,"MASCOT Score",43.0000000,1.0000000,,,,,-1.3200000
WIASPTANRPK,ph,S,148,true,"TOR Kinase and ABA Receptor",100,29290610,XCorr,2.5108767,1.0000000,,,,0.00091080000856891,
WIASPTANRPK,ph,S,148,true,"Tissue atlas Arabidopsis - ProteomicsDB",114,32188942,"MaxQuant score",138.4200000,0.9994890,,,,2.4319099338754E-6,
KGPSFGR,ph,S,169,true,"TOR Kinase and ABA Receptor",100,29290610,XCorr,2.2308557,1.0000000,,,,0.011189999990165,
HDSSVATAFAQPPSTAR,ph,S,247,true,"SnRK2 protein kinase substrates",85,23776212,XCorr,2.5886765,0.9930000,,,,0.00016864300414454,
HDSSVATAFAQPPSTAR,ph,S,247,true,"atm and atr DNA damage response",88,25561503,"MASCOT Score",90.0000000,0.9970000,,,,,-0.2500000
HDSSVATAFAQPPSTAR,ph,S,247,true,"Phospho cell culture sucrose/TOR",109,30833711,,,0.9990840,,,,,
HDSSVATAFAQPPSTAR,ph,S,247,true,"Tissue atlas Arabidopsis - ProteomicsDB",114,32188942,"MaxQuant score",396.4200000,0.9999520,,,,0,
DMGTEMTPIASQEPSR,ph,T,273,true,"atm and atr DNA damage response",88,25561503,"MASCOT Score",32.0000000,0.9920000,,,,,-0.6900000
DMGTEMTPIASQEPSR,ph,T,273,true,"Tissue atlas Arabidopsis - ProteomicsDB",114,32188942,"MaxQuant score",75.9110000,0.9995760,,,,5.8238001656719E-5,
DMGTEMTPIASQEPSR,ph,S,277,true,"atm and atr DNA damage response",88,25561503,"MASCOT Score",32.0000000,1.0000000,,,,,-0.6900000
DMGTEMTPIASQEPSR,ph,S,277,true,"Tissue atlas Arabidopsis - ProteomicsDB",114,32188942,"MaxQuant score",137.6100000,0.9999980,,,,4.381549983945E-11,
DMGTEMTPIASQEPSRNGTPIR,ph,S,281,true,"atm and atr DNA damage response",88,25561503,"MASCOT Score",24.0000000,1.0000000,,,,,-0.6200000
DMGTEMTPIASQEPSR,ph,S,281,true,"Tissue atlas Arabidopsis - ProteomicsDB",114,32188942,"MaxQuant score",205.7800000,1.0000000,,,,0,
DMGTEMTPIASQEPSRNGTPIR,ph,T,285,true,"atm and atr DNA damage response",88,25561503,"MASCOT Score",24.0000000,1.0000000,,,,,-0.6200000
DMGTEMTPIASQEPSRNGTPIR,ph,T,285,true,"Tissue atlas Arabidopsis - ProteomicsDB",114,32188942,"MaxQuant score",208.1200000,0.9998740,,,,0,
ATTPIRSPISSEPSSPGR,ph,T,291,true,"Tissue atlas Arabidopsis - ProteomicsDB",114,32188942,"MaxQuant score",228.7900000,0.9889830,,,,0,
ATTPIRSPISSEPSSPGR,ph,S,295,true,"SnRK2 protein kinase substrates",85,23776212,XCorr,2.8590190,0.9960000,,,,0.0026860500220209,
ATTPIRSPISSEPSSPGR,ph,S,295,true,"atm and atr DNA damage response",88,25561503,"MASCOT Score",25.0000000,1.0000000,,,,,-0.0800000
ATTPIRSPISSEPSSPGR,ph,S,295,true,"TOR Kinase and ABA Receptor",100,29290610,XCorr,3.1176929,0.9717000,,,,0.064920000731945,
ATTPIRSPISSEPSSPGR,ph,S,295,true,"Tissue atlas Arabidopsis - ProteomicsDB",114,32188942,"MaxQuant score",243.1600000,0.9999960,,,,0,
ATTPIRSPISSEPSSPGR,ph,S,298,true,"Tissue atlas Arabidopsis - ProteomicsDB",114,32188942,"MaxQuant score",146.9700000,0.9023360,,,,6.0228396828525E-17,
ATTPIRSPISSEPSSPGR,ph,S,299,true,"Large-scale phosphorylation discovery",44,23111157,XCorr,4.0630000,,,,,,
ATTPIRSPISSEPSSPGR,ph,S,299,true,"TOR Kinase and ABA Receptor",100,29290610,XCorr,3.1176929,0.8704000,,,,0.064920000731945,
SPISSEPSSPGR,ph,S,299,true,"Tissue atlas Arabidopsis - ProteomicsDB",114,32188942,"MaxQuant score",243.1600000,0.9995330,,,,0,
ATTPIRSPISSEPSSPGR,ph,S,302,true,"atm and atr DNA damage response",88,25561503,"MASCOT Score",25.0000000,0.9860000,,,,,-0.0800000
SPISSEPSSPGR,ph,S,302,true,"Lateral root-induction - NAA vs control",106,23328941,"MASCOT Score",22.0000000,,,,,,
SPISSEPSSPGR,ph,S,302,true,"Tissue atlas Arabidopsis - ProteomicsDB",114,32188942,"MaxQuant score",232.6000000,0.9098520,,,,0,
ATTPIRSPISSEPSSPGR,ph,S,303,true,"SnRK2 protein kinase substrates",85,23776212,XCorr,2.8590190,0.8920000,,,,0.0026860500220209,
ATTPIRSPISSEPSSPGR,ph,S,303,true,"atm and atr DNA damage response",88,25561503,"MASCOT Score",25.0000000,0.9860000,,,,,-0.0800000
ATTPIRSPISSEPSSPGR,ph,S,303,true,"Tissue atlas Arabidopsis - ProteomicsDB",114,32188942,"MaxQuant score",243.1600000,0.9906730,,,,0,
SPISSEPSSPGR,ph,S,303,true,"atm and atr DNA damage response",88,25561503,"MASCOT Score",45.0000000,0.9980000,,,,,-0.2400000
QASASPMSNKELSEK,ph,S,311,true,"Tissue atlas Arabidopsis - ProteomicsDB",114,32188942,"MaxQuant score",72.3410000,0.9812150,,,,0.00028979100170545,
QASASPMSNK,ph,S,311,true,"atm and atr DNA damage response",88,25561503,"MASCOT Score",48.0000000,0.9970000,,,,,-0.2700000
EDEDKDASTSLK,ph,S,357,true,"Tissue atlas Arabidopsis - ProteomicsDB",114,32188942,"MaxQuant score",237.9200000,0.9881740,,,,0,
EDEDKDASTSLK,ph,S,359,true,"Tissue atlas Arabidopsis - ProteomicsDB",114,32188942,"MaxQuant score",216.0100000,0.9804320,,,,1.1104100627378E-38,
ASLQTSKSVSEAR,ph,S,371,true,"Tissue atlas Arabidopsis - ProteomicsDB",114,32188942,"MaxQuant score",157.5400000,0.9957110,,,,1.5208699577496E-10,
IQAWENHQKAK,me2,K,407,true,"Arabidopsis protein methylome",123,31809900,"MaxQuant Score",118.2800000,1.0000000,,,,2.2585899817074E-10,1.9609000
