Peptide,PTM,ModifiedAA,ModifiedPosition,PeptideUniqueToGene,ExperimentDesc,ExpID,PubmedID,ScoreType,IdentScore,LocProb,Log2FChange,PQ-val,QuantSig,PEP,MassErrorPPM
MFAPATQPQQQHEQKKQSETVSSAEE,nta,M,1,true,"Arabidopsis translation initiation landscape - NTA",167a,35069635,,,,,,,,
KQSETVSSAEEDALK,ph,S,22,true,"Tissue atlas Arabidopsis - ProteomicsDB",114,32188942,"MaxQuant score",159.8300000,0.8748700,,,,1.4400600156783E-10,
KQSETVSSAEEDALK,ph,S,23,true,"Tissue atlas Arabidopsis - ProteomicsDB",114,32188942,"MaxQuant score",180.3200000,0.8565580,,,,3.8428700792024E-25,
WNTDCVYFLASPLTCK,ph,S,41,true,"Phospho cell culture sucrose/TOR",109,30833711,,,0.8141920,,,,,
GHTDISAAPR,ph,S,191,true,"Tissue atlas Arabidopsis - ProteomicsDB",114,32188942,"MaxQuant score",84.0530000,0.9994860,,,,0.0012504300102592,
SVEGYIPNHVGYEPVVQR,nt,S,206,true,"Arabidopsis translation initiation landscape - NT",167b,35069635,,,,,,,,
SVEGYIPNHVGYEPVVQR,ph,S,206,true,"Lateral root-induction - NAA vs control",106,23328941,"MASCOT Score",27.0000000,,,,,,
SVEGYIPNHVGYEPVVQR,ph,S,206,true,"Phospho cell culture sucrose/TOR",109,30833711,,,0.9999990,,,,,
SVEGYIPNHVGYEPVVQR,ph,S,206,true,"Col-0 callus - FC Col-0 vs. Col-0 Xray",111a,31410901,,52.3600000,,0.6922413,0.0000000,NO,,0.7180185
SVEGYIPNHVGYEPVVQR,ph,S,206,true,"Col-0 X-ray callus - FC Col-0 vs. Col-0 Xray",111b,31410901,,52.3600000,,0.6922413,0.0000000,NO,,0.7180185
SVEGYIPNHVGYEPVVQR,ph,S,206,true,"atm callus - FC atm vs. atm Xray",111c,31410901,,52.3600000,,1.8842829,0.0000000,NO,,0.7180185
SVEGYIPNHVGYEPVVQR,ph,S,206,true,"atm-3 X-ray callus - FC atm vs. atm Xray",111d,31410901,,52.3600000,,1.8842829,0.0000000,NO,,0.7180185
SVEGYIPNHVGYEPVVQR,ph,S,206,true,"Tissue atlas Arabidopsis - ProteomicsDB",114,32188942,"MaxQuant score",258.8900000,1.0000000,,,,0,
YGSDDNNSFHNGK,ph,S,246,true,"Tissue atlas Arabidopsis - ProteomicsDB",114,32188942,"MaxQuant score",204.3300000,1.0000000,,,,9.4698503063438E-39,
YGSDDNNSFHNGKDADDVLR,ph,S,251,true,"Tissue atlas Arabidopsis - ProteomicsDB",114,32188942,"MaxQuant score",288.0000000,1.0000000,,,,0,
YGSDDNNSFHNGK,ph,S,251,true,"TOR Kinase and ABA Receptor",100,29290610,XCorr,3.3085954,0.8820000,,,,0.018090000376105,
ESSPGFDVLVDNEAGDSEYYHVEDR,ph,S,265,true,"SnRK2 protein kinase substrates",85,23776212,XCorr,4.0031209,0.7890000,,,,7.163790201048E-7,
ESSPGFDVLVDNEAGDSEYYHVEDR,ph,S,265,true,"Lateral root-induction - NAA vs control",106,23328941,"MASCOT Score",37.0000000,,,,,,
DADDVLRESSPGFDVLVDNEAGDSEYYHVEDR,ph,S,266,true,"srk2dei ABA signaling phopshoproteomics",83,23572148,"MASCOT Score",88.0000000,,,,,,0.0000000
DADDVLRESSPGFDVLVDNEAGDSEYYHVEDR,ph,S,266,true,"TOR Kinase and ABA Receptor",100,29290610,XCorr,5.5402517,0.8742000,,,,4.6169998313417E-6,
ESSPGFDVLVDNEAGDSEYYHVEDR,ph,S,266,true,"Lateral root-induction - NAA vs control",106,23328941,"MASCOT Score",49.0000000,,,,,,
ESSPGFDVLVDNEAGDSEYYHVEDR,ph,S,266,true,"Phospho cell culture sucrose/TOR",109,30833711,,,0.9786870,,,,,
ESSPGFDVLVDNEAGDSEYYHVEDR,ph,S,266,true,"Col-0 callus - FC Col-0 vs. Col-0 Xray",111a,31410901,,29.1700000,,1.9375006,0.0152371,YES,,2.6240568
ESSPGFDVLVDNEAGDSEYYHVEDR,ph,S,266,true,"Col-0 X-ray callus - FC Col-0 vs. Col-0 Xray",111b,31410901,,29.1700000,,1.9375006,0.0152371,YES,,2.6240568
ESSPGFDVLVDNEAGDSEYYHVEDR,ph,S,266,true,"atm callus - FC atm vs. atm Xray",111c,31410901,,29.1700000,,1.3853459,0.0167563,YES,,2.6240568
ESSPGFDVLVDNEAGDSEYYHVEDR,ph,S,266,true,"atm-3 X-ray callus - FC atm vs. atm Xray",111d,31410901,,29.1700000,,1.3853459,0.0167563,YES,,2.6240568
ESSPGFDVLVDNEAGDSEYYHVEDR,ph,S,266,true,"Tissue atlas Arabidopsis - ProteomicsDB",114,32188942,"MaxQuant score",278.2200000,0.9985130,,,,0,
SQERGNSEYDPDFSAIADGDKEALR,ph,S,293,true,"Chloroplast kinase substrates",60,19376835,"MASCOT Score",39.1100000,,,,,,-0.1000420
SQERGNSEYDPDFSAIADGDKEALR,ph,S,293,true,"SnRK2 protein kinase substrates",85,23776212,XCorr,4.1804190,0.9090000,,,,3.96250006599E-16,
SQERGNSEYDPDFSAIADGDKEALR,ph,S,293,true,"Phospho cell culture sucrose/TOR",109,30833711,,,0.9314920,,,,,
SQERGNSEYDPDFSAIADGDKEALR,ph,S,293,true,"Tissue atlas Arabidopsis - ProteomicsDB",114,32188942,"MaxQuant score",198.3900000,0.9999970,,,,0,
SQERGNSEYDPDFSAIADGDK,ph,S,293,true,"srk2dei ABA signaling phopshoproteomics",83,23572148,"MASCOT Score",77.0000000,,,,,,0.0007000
SQERGNSEYDPDFSAIADGDK,ph,S,293,true,"TOR Kinase and ABA Receptor",100,29290610,XCorr,5.1690311,0.9884000,,,,3.7869999687246E-6,
SQERGNSEYDPDFSAIADGDK,ph,S,299,true,"srk2dei ABA signaling phopshoproteomics",83,23572148,"MASCOT Score",84.0000000,,,,,,-0.0001000
GNSEYDPDFSAIADGDKEALR,ph,S,299,true,"Col-0 callus - FC Col-0 vs. Col-0 Xray",111a,31410901,,29.0900000,,1.0153138,0.0000000,NO,,-0.2334332
GNSEYDPDFSAIADGDKEALR,ph,S,299,true,"Col-0 X-ray callus - FC Col-0 vs. Col-0 Xray",111b,31410901,,29.0900000,,1.0153138,0.0000000,NO,,-0.2334332
GNSEYDPDFSAIADGDKEALR,ph,S,299,true,"atm callus - FC atm vs. atm Xray",111c,31410901,,29.0900000,,1.9469303,0.0000000,NO,,-0.2334332
GNSEYDPDFSAIADGDKEALR,ph,S,299,true,"atm-3 X-ray callus - FC atm vs. atm Xray",111d,31410901,,29.0900000,,1.9469303,0.0000000,NO,,-0.2334332
GNSEYDPDFSAIADGDKEALR,ph,S,299,true,"Tissue atlas Arabidopsis - ProteomicsDB",114,32188942,"MaxQuant score",261.1900000,1.0000000,,,,0,
GNSEYDPDFSAIADGDK,ph,S,299,true,"Lateral root-induction - NAA vs control",106,23328941,"MASCOT Score",74.0000000,,,,,,
GNSEYDPDFSAIADGDKEALR,ph,S,306,true,"Tissue atlas Arabidopsis - ProteomicsDB",114,32188942,"MaxQuant score",190.5000000,1.0000000,,,,0,
GNSEYDPDFSAIADGDKEALR,ub,K,313,true,"Arabidopsis ubiquitination COFRADIC",40,26744219,"MaxQuant Score",230.7100000,1.0000000,,,,0,0.2320000
RVSSEREDR,ph,S,338,true,"Tissue atlas Arabidopsis - ProteomicsDB",114,32188942,"MaxQuant score",94.1220000,0.9667090,,,,0.00058568798704073,
VYAEDERSENILESDLR,ph,S,356,true,"Tissue atlas Arabidopsis - ProteomicsDB",114,32188942,"MaxQuant score",194.2500000,1.0000000,,,,9.3690535065064E-40,
SENILESDLR,ph,S,362,true,"Tissue atlas Arabidopsis - ProteomicsDB",114,32188942,"MaxQuant score",140.1400000,1.0000000,,,,5.6983599279192E-6,
SVGGHDYAAPDSSMDRGYRE,nt,S,380,true,"Arabidopsis translation initiation landscape - NT",167b,35069635,,,,,,,,
LSVGGHDYAAPDSSMDR,ph,S,380,true,"Tissue atlas Arabidopsis - ProteomicsDB",114,32188942,"MaxQuant score",160.0900000,1.0000000,,,,5.8783497586852E-17,
LSVGGHDYAAPDSSMDR,ph,S,391,true,"Tissue atlas Arabidopsis - ProteomicsDB",114,32188942,"MaxQuant score",100.9700000,0.8233510,,,,9.7871600246435E-7,
SNGEEGHHFDRR,nt,S,425,true,"Arabidopsis translation initiation landscape - NT",167b,35069635,,,,,,,,
SNGEEGHHFDR,ph,S,425,true,"Tissue atlas Arabidopsis - ProteomicsDB",114,32188942,"MaxQuant score",146.3700000,1.0000000,,,,2.9286599101397E-7,
GRLEENHSGNQER,ph,S,465,true,"Tissue atlas Arabidopsis - ProteomicsDB",114,32188942,"MaxQuant score",42.1700000,1.0000000,,,,0.015062600374222,
LEENHSGNQER,ph,S,465,true,"atm and atr DNA damage response",88,25561503,"MASCOT Score",23.0000000,1.0000000,,,,,-1.5700000
KSAPKSSR,ub,K,487,true,"Arabidopsis ubiquitination COFRADIC",40,26744219,"MaxQuant Score",130.6600000,1.0000000,,,,0.003000000026077,0.5880000
KSAPKSSR,ub,K,491,true,"Arabidopsis ubiquitination COFRADIC",40,26744219,"MaxQuant Score",130.6600000,1.0000000,,,,0.003000000026077,0.5880000
EESKPEPSLGKR,ub,K,498,true,"Arabidopsis ubiquitination COFRADIC",40,26744219,"MaxQuant Score",74.3920000,1.0000000,,,,0.00012899999273941,-0.7330000
EESKPEPSLGK,ph,S,502,true,"Tissue atlas Arabidopsis - ProteomicsDB",114,32188942,"MaxQuant score",143.0800000,0.9999970,,,,9.0565897892247E-8,
EESKPEPSLGKR,ub,K,505,true,"Arabidopsis ubiquitination COFRADIC",40,26744219,"MaxQuant Score",107.1700000,1.0000000,,,,3.9029998677442E-10,0.0180000
DSFAAPLPFSEILKR,ub,K,534,true,"Arabidopsis ubiquitination COFRADIC",40,26744219,"MaxQuant Score",98.9430000,1.0000000,,,,2.7030000840264E-15,0.5230000
KKAAASGGSR,ub,K,537,true,"Arabidopsis ubiquitination COFRADIC",40,26744219,"MaxQuant Score",97.7340000,0.9190000,,,,0.00080989999696612,-0.1360000
NNNKDETISKEEAGDEIK,ph,T,552,true,"LAXIC - mannitol vs control",84b,23660473,XCorr,2.3300000,1.0000000,,,,0.015869699418545,
NNNKDETISKEEAGDEIK,ph,T,552,true,"SnRK2 protein kinase substrates",85,23776212,XCorr,2.1903949,1.0000000,,,,0.055507600307465,
NNNKDETISKEEAGDEIK,ph,S,554,true,"LAXIC - mannitol vs control",84b,23660473,XCorr,2.3300000,1.0000000,,,,0.015869699418545,
NNNKDETISKEEAGDEIK,ph,S,554,true,"SnRK2 protein kinase substrates",85,23776212,XCorr,2.1903949,1.0000000,,,,0.055507600307465,
NNNKDETISKEEAGDEIK,ph,S,554,true,"Tissue atlas Arabidopsis - ProteomicsDB",114,32188942,"MaxQuant score",223.9700000,0.9999170,,,,0,
DETISKEEAGDEIK,ph,S,554,true,"Phospho cell culture sucrose/TOR",109,30833711,,,0.9996420,,,,,
TEVVSEPK,ph,S,574,true,"Tissue atlas Arabidopsis - ProteomicsDB",114,32188942,"MaxQuant score",102.3600000,1.0000000,,,,4.1182000131812E-5,
