Peptide,PTM,ModifiedAA,ModifiedPosition,PeptideUniqueToGene,ExperimentDesc,ExpID,PubmedID,ScoreType,IdentScore,LocProb,Log2FChange,PQ-val,QuantSig,PEP,MassErrorPPM
MLEIGSPNALFFR,ph,S,6,true,"TOR Kinase and ABA Receptor",100,29290610,XCorr,4.6714044,1.0000000,,,,6.075999863242E-7,
TNTTCNNLLR,ph,T,16,true,"atm and atr DNA damage response",88,25561503,"MASCOT Score",34.0000000,0.9270000,,,,,0.4900000
TNTTCNNLLR,ph,T,16,true,"Tissue atlas Arabidopsis - ProteomicsDB",114,32188942,"MaxQuant score",132.8500000,0.9999790,,,,6.218790076673E-5,
YSAGRGGHVNLK,me1,R,421,false,"Arabidopsis protein methylome",123,31809900,"MaxQuant Score",54.0230000,1.0000000,,,,0.00091767200501636,-0.5200300
ESIYGSKPSPR,ph,S,513,false,"TOR Kinase and ABA Receptor",100,29290610,XCorr,3.1485932,0.9998000,,,,0.00040640000952408,
ESIYGSKPSPR,ph,S,513,false,"Tissue atlas Arabidopsis - ProteomicsDB",114,32188942,"MaxQuant score",194.8600000,0.9999630,,,,3.5078500526623E-18,
RGSVGTTTPDVLLTPR,ph,S,543,true,"atm and atr DNA damage response",88,25561503,"MASCOT Score",49.0000000,1.0000000,,,,,-0.2400000
RGSVGTTTPDVLLTPR,ph,S,543,true,"Tissue atlas Arabidopsis - ProteomicsDB",114,32188942,"MaxQuant score",146.9700000,0.9999560,,,,4.4334999560469E-10,
GSVGTTTPDVLLTPR,ph,T,547,true,"Tissue atlas Arabidopsis - ProteomicsDB",114,32188942,"MaxQuant score",104.4100000,0.9081440,,,,3.4027299989248E-5,
RGSVGTTTPDVLLTPR,ph,T,548,true,"Tissue atlas Arabidopsis - ProteomicsDB",114,32188942,"MaxQuant score",120.7400000,0.8893050,,,,3.0604999778916E-7,
RGSVGTTTPDVLLTPR,ph,T,554,true,"atm and atr DNA damage response",88,25561503,"MASCOT Score",49.0000000,1.0000000,,,,,-0.2400000
RGSVGTTTPDVLLTPR,ph,T,554,true,"TOR Kinase and ABA Receptor",100,29290610,XCorr,3.9301980,1.0000000,,,,0.00026729999808595,
RGSVGTTTPDVLLTPR,ph,T,554,true,"Tissue atlas Arabidopsis - ProteomicsDB",114,32188942,"MaxQuant score",205.1200000,1.0000000,,,,1.2611686178923E-44,
GSVGTTTPDVLLTPR,ph,T,554,true,"Large-scale phosphorylation discovery",44,23111157,XCorr,3.4250000,,,,,,
RLSTTPLNYVAMQK,ph,S,575,true,"atm and atr DNA damage response",88,25561503,"MASCOT Score",40.0000000,0.9660000,,,,,-0.3600000
RLSTTPLNYVAMQK,ph,S,575,true,"Tissue atlas Arabidopsis - ProteomicsDB",114,32188942,"MaxQuant score",161.8600000,0.9581330,,,,3.4274100918497E-11,
RLSTTPLNYVAMQK,ph,T,576,true,"atm and atr DNA damage response",88,25561503,"MASCOT Score",22.0000000,0.9940000,,,,,-1.7300000
LSTTPLNYVAMQK,ph,T,576,true,"Tissue atlas Arabidopsis - ProteomicsDB",114,32188942,"MaxQuant score",189.2400000,0.9999060,,,,8.7397603077736E-23,
LSTTPLNYVAMQK,ph,T,577,true,"atm and atr DNA damage response",88,25561503,"MASCOT Score",30.0000000,0.9120000,,,,,-0.3100000
