Peptide,PTM,ModifiedAA,ModifiedPosition,PeptideUniqueToGene,ExperimentDesc,ExpID,PubmedID,ScoreType,IdentScore,LocProb,Log2FChange,PQ-val,QuantSig,PEP,MassErrorPPM
QDLQIVNAER,nt,Q,25,true,"HUNTER N-terminome: legumain, GluC and trypsin",119,31951383,"MaxQuant score",137.4600000,,,,,,
TYLPLDVKPTEQPDAPNDTGYYR,ng,N,106,true,"UDP-GlcNAc transporter glycopeptide analysis",135,30224661,,,,,,,1.443216206265E-12,0.7000000
VNSVYYRDEIGNISTSHLR,ng,N,298,true,"Conserved N-glycosylation",74,22633491,"MaxQuant Score",189.8600000,1.0000000,,,,4.5900001143473E-23,-0.8360000
VNSVYYRDEIGNISTSHLR,ng,N,298,true,"N-Glycopeptide Profiling in Arabidopsis Infloresce",132,27067053,"MOWSE score",38.5000000,,,,,0.00014000000373926,
VNSVYYRDEIGNISTSHLR,ng,N,298,true,"UDP-GlcNAc transporter glycopeptide analysis",135,30224661,,,,,,,6.0301015764708E-5,1.2000000
DEIGNISTSHLR,ng,N,298,true,"N-glycan occupancy Arabidopsis glycoproteins",87,23994444,"Ladder score",73.9000000,,,,,,
DEIGNISTSHLR,ng,N,298,true,"N-Glycopeptide Profiling in Arabidopsis Infloresce",132,27067053,"MOWSE score",46.6000000,,,,,2.5999999706983E-5,
DEIGNISTSHLR,ng,N,298,true,"ER-associatied N-glycan degradation chilling stres",133,27558752,,,,,,,,
DEIGNISTSHLR,ng,N,298,true,"N-linked Glycan Micro-heterogeneity Arabidopsis",134,29237727,,,,,,,,
DEIGNISTSHLR,ng,N,298,true,"UDP-GlcNAc transporter glycopeptide analysis",135,30224661,,,,,,,8.5922039611257E-15,0.2000000
KSELEFEPR,ub,K,310,true,"TAP 6xHis-tag Ub",1,19292762,XCorr,2.5900000,,,,,,
KSELEFEPR,ub,K,310,true,"Arabidopsis ubiquitination by TUBEs",2,23667124,,,,,,,,
YLNFTFGCPLVETIVNK,ng,N,352,true,"ER-associatied N-glycan degradation chilling stres",133,27558752,,,,,,,,
