Peptide,PTM,ModifiedAA,ModifiedPosition,PeptideUniqueToGene,ExperimentDesc,ExpID,PubmedID,ScoreType,IdentScore,LocProb,Log2FChange,PQ-val,QuantSig,PEP,MassErrorPPM
VNLSSSSGK,ph,S,18,true,"atm and atr DNA damage response",88,25561503,"MASCOT Score",21.0000000,0.9920000,,,,,1.2300000
KVNLSSSSGKFK,ph,S,20,true,"Protein sumoylation and phosphorylation cross-talk",97,28419593,,,,,,,,
VNLSSSSGKFK,ph,S,20,true,"Tissue atlas Arabidopsis - ProteomicsDB",114,32188942,"MaxQuant score",144.8800000,0.7608830,,,,7.5871298577113E-8,
KVNLSSSSGKFK,ph,S,21,true,"Phospho cell culture sucrose/TOR",109,30833711,,,0.9170590,,,,,
VNLSSSSGKFK,ph,S,21,true,"atm and atr DNA damage response",88,25561503,"MASCOT Score",25.0000000,1.0000000,,,,,0.7600000
VNLSSSSGKFK,ph,S,21,true,"Tissue atlas Arabidopsis - ProteomicsDB",114,32188942,"MaxQuant score",203.2500000,0.9962410,,,,4.2786801812924E-24,
KVNLSSSSGK,ph,S,21,true,"atm and atr DNA damage response",88,25561503,"MASCOT Score",49.0000000,0.9680000,,,,,-1.6200000
VNLSSSSGK,ph,S,21,true,"atm and atr DNA damage response",88,25561503,"MASCOT Score",27.0000000,0.9970000,,,,,-1.9400000
VLGSSSSSSAPPVNPIQNR,ph,S,35,true,"Tissue atlas Arabidopsis - ProteomicsDB",114,32188942,"MaxQuant score",266.1700000,0.9572400,,,,0,
FNSSQAPNPTPR,ph,S,51,true,"Tissue atlas Arabidopsis - ProteomicsDB",114,32188942,"MaxQuant score",197.0100000,0.9992870,,,,1.2613199565496E-24,
FNSSQAPNPTPR,ph,T,58,true,"Tissue atlas Arabidopsis - ProteomicsDB",114,32188942,"MaxQuant score",186.2900000,1.0000000,,,,1.1110599514933E-19,
APQDGFDPYGAFITSSNR,ph,S,108,true,"Tissue atlas Arabidopsis - ProteomicsDB",114,32188942,"MaxQuant score",198.2400000,0.8371660,,,,1.4012984643248E-45,
APQDGFDPYGAFITSSNR,ph,S,109,true,"Tissue atlas Arabidopsis - ProteomicsDB",114,32188942,"MaxQuant score",340.1800000,0.9508630,,,,0,
KIAESQLLIPR,ph,S,331,true,"Tissue atlas Arabidopsis - ProteomicsDB",114,32188942,"MaxQuant score",212.9000000,1.0000000,,,,6.2100398694898E-21,
