Peptide,PTM,ModifiedAA,ModifiedPosition,PeptideUniqueToGene,ExperimentDesc,ExpID,PubmedID,ScoreType,IdentScore,LocProb,Log2FChange,PQ-val,QuantSig,PEP,MassErrorPPM
VSTPHSSTIILDSFPPSQAFFNK,ng,N,171,true,"Conserved N-glycosylation",74,22633491,"MaxQuant Score",184.0400000,1.0000000,,,,0,-1.1450000
GGPSEHDATVENANTYNSNLIQHVINK,ng,N,295,true,"Conserved N-glycosylation",74,22633491,"MaxQuant Score",339.2200000,1.0000000,,,,0,3.2950000
GGPSEHDATVENANTYNSNLIQHVINK,ng,N,295,true,"UDP-GlcNAc transporter glycopeptide analysis",135,30224661,,,,,,,2.5325233052562E-19,0.9000000
LAGAGAILANDTTNQTFCIAK,ng,N,353,true,"Conserved N-glycosylation",74,22633491,"MaxQuant Score",196.0300000,1.0000000,,,,0,2.3520000
ASGSCDFK,ox,C,424,false,"OxiTRAQ Arabidopsis - 5 mM H2O2 versus control",47,24376095,,,,-0.2122961,0.1711744,NO,,
ASGSCDFK,sno,C,424,false,"hot5-4 / wildtype, FAT-switch S-nitrosoproteome",169,37277371,,,,,,,,
GTCVFPGSAK,ox,C,442,true,"OxiTRAQ Arabidopsis - 5 mM H2O2 versus control",47,24376095,,,,-0.1134928,0.2762115,NO,,
GTCVFPGSAK,ox,C,442,true,"Bicarbonate Induced Redox Changes - 30 min",117b,28184230,,,,0.5260688,,YES,,
