Peptide,PTM,ModifiedAA,ModifiedPosition,PeptideUniqueToGene,ExperimentDesc,ExpID,PubmedID,ScoreType,IdentScore,LocProb,Log2FChange,PQ-val,QuantSig,PEP,MassErrorPPM
ANQSTETNQPSNMQTYGVPIYAADWIPEVDVR,nt,A,2,true,"FtsH12 N-terminome: WT / FtsH12 knockdown miRNA",118,33216923,"MaxQuant score",49.4230000,,,,,0.046041999012232,
ANQSTETNQPSNMQTY,nta,A,2,true,"Characterization plant N-terminal acetylation",6,22223895,"MASCOT Score",64.8800000,,,,,,
ANQSTETNQPSNMQTY,nta,A,2,true,"Arabidopsis translation initiation landscape - NTA",167a,35069635,,,,,,,,
SKIIMDPEKSEDDDESSSSSSSSR,ph,S,43,true,"Tissue atlas Arabidopsis - ProteomicsDB",114,32188942,"MaxQuant score",323.7900000,1.0000000,,,,0,
IIMDPEKSEDDDESSSSSSSSR,ph,S,43,true,"Phosphorylation Early Elicitor Signaling",23,17317660,,,,,,,,
IIMDPEKSEDDDESSSSSSSSR,ph,S,43,true,"Chloroplast kinase substrates",60,19376835,"MASCOT Score",55.8200000,,,,,,-0.7143730
IIMDPEKSEDDDESSSSSSSSR,ph,S,43,true,"LAXIC - ABA stress",84a,23660473,XCorr,4.4000000,1.0000000,,,,8.9300002059645E-8,
IIMDPEKSEDDDESSSSSSSSR,ph,S,43,true,"atm and atr DNA damage response",88,25561503,"MASCOT Score",63.0000000,1.0000000,,,,,0.2700000
IIMDPEKSEDDDESSSSSSSSR,ph,S,43,true,"TOR Kinase and ABA Receptor",100,29290610,XCorr,6.0395160,1.0000000,,,,2.1119999082941E-9,
IIMDPEKSEDDDESSSSSSSSR,ph,S,43,true,"Phospho cell culture sucrose/TOR",109,30833711,,,1.0000000,,,,,
IIMDPEKSEDDDESSSSSSSSR,ph,S,43,true,"Col-0 callus - FC Col-0 vs. Col-0 Xray",111a,31410901,,24.8500000,,1.8188798,0.0000000,NO,,0.0804460
IIMDPEKSEDDDESSSSSSSSR,ph,S,43,true,"Col-0 X-ray callus - FC Col-0 vs. Col-0 Xray",111b,31410901,,24.8500000,,1.8188798,0.0000000,NO,,0.0804460
IIMDPEKSEDDDESSSSSSSSR,ph,S,43,true,"atm callus - FC atm vs. atm Xray",111c,31410901,,24.8500000,,1.3637184,0.0000000,NO,,0.0804460
IIMDPEKSEDDDESSSSSSSSR,ph,S,43,true,"atm-3 X-ray callus - FC atm vs. atm Xray",111d,31410901,,24.8500000,,1.3637184,0.0000000,NO,,0.0804460
IIMDPEKSEDDDESSSSSSSSR,ph,S,49,true,"atm and atr DNA damage response",88,25561503,"MASCOT Score",60.0000000,0.9910000,,,,,-0.5000000
IIMDPEKSEDDDESSSSSSSSR,ph,S,49,true,"Tissue atlas Arabidopsis - ProteomicsDB",114,32188942,"MaxQuant score",223.7000000,0.8540940,,,,0,
IIMDPEKSEDDDESSSSSSSSR,ph,S,50,true,"atm and atr DNA damage response",88,25561503,"MASCOT Score",63.0000000,0.9810000,,,,,0.2700000
IIMDPEKSEDDDESSSSSSSSR,ph,S,50,true,"TOR Kinase and ABA Receptor",100,29290610,XCorr,3.8065155,0.9623000,,,,0.0008936999947764,
IIMDPEKSEDDDESSSSSSSSR,ph,S,50,true,"Phospho cell culture sucrose/TOR",109,30833711,,,0.8005560,,,,,
IIMDPEKSEDDDESSSSSSSSR,ph,S,50,true,"Tissue atlas Arabidopsis - ProteomicsDB",114,32188942,"MaxQuant score",263.2700000,0.9700800,,,,0,
IIMDPEKSEDDDESSSSSSSSR,ph,S,51,true,"Phospho cell culture sucrose/TOR",109,30833711,,,0.8504020,,,,,
IIMDPEKSEDDDESSSSSSSSR,ph,S,51,true,"Tissue atlas Arabidopsis - ProteomicsDB",114,32188942,"MaxQuant score",218.6900000,0.7649140,,,,0,
SCIVLSGGGGEGR,ox,C,59,true,"OxiTRAQ Arabidopsis - 5 mM H2O2 versus control",47,24376095,,,,0.2945692,0.0397024,NO,,
SGISNVILICR,ph,S,71,true,"Tissue atlas Arabidopsis - ProteomicsDB",114,32188942,"MaxQuant score",135.1000000,0.9998000,,,,2.3778800368746E-6,
EDNQAGESEEVIKELR,ub,K,148,true,"Ubiquitination Membrane Proteins",120,33585938,,,,,,,,
EDNQAGESEEVIKELR,ub,K,148,true,"upl3 mutant / wildtype",168,35926874,"MaxQuant score",105.2800000,1.0000000,-0.5799219,0.0846390,NO,4.1585298760083E-8,-0.1247100
GGSIITCDTK,ox,C,270,true,"OxiTRAQ Arabidopsis - 5 mM H2O2 versus control",47,24376095,,,,0.2898497,0.0279617,NO,,
GGSIITCDTK,ox,C,270,true,"SPEAR - 10 mM H2O2 / mock",138a,34619326,,,,0.4336866,0.0310529,YES,,
GGSIITCDTK,sno,C,270,true,"hot5-4 / wildtype, FAT-switch S-nitrosoproteome",169,37277371,,,,0.3194853,0.0407963,NO,,
