Peptide,PTM,ModifiedAA,ModifiedPosition,PeptideUniqueToGene,ExperimentDesc,ExpID,PubmedID,ScoreType,IdentScore,LocProb,Log2FChange,PQ-val,QuantSig,PEP,MassErrorPPM
IFSPDQCSGINR,sno,C,39,false,"hot5-4 / wildtype, FAT-switch S-nitrosoproteome",169,37277371,,,,,,,,
SLMMTPR,ph,T,219,true,"Tissue atlas Arabidopsis - ProteomicsDB",114,32188942,"MaxQuant score",202.6700000,0.9999990,,,,0,
SLMMTPRPSNLTGAEIYSLSSTPR,ph,S,223,true,"Tissue atlas Arabidopsis - ProteomicsDB",114,32188942,"MaxQuant score",265.7500000,0.9953520,,,,0,
PSNLTGAEIYSLSSTPR,ph,S,232,true,"atm and atr DNA damage response",88,25561503,"MASCOT Score",39.0000000,0.9970000,,,,,-0.2000000
PSNLTGAEIYSLSSTPR,ph,S,232,true,"Tissue atlas Arabidopsis - ProteomicsDB",114,32188942,"MaxQuant score",210.1700000,0.9982840,,,,0,
PSNLTGAEIYSLSSTPR,ph,S,235,true,"atm and atr DNA damage response",88,25561503,"MASCOT Score",36.0000000,0.9970000,,,,,0.0600000
PSNLTGAEIYSLSSTPR,ph,S,235,true,"Tissue atlas Arabidopsis - ProteomicsDB",114,32188942,"MaxQuant score",343.2900000,0.8337450,,,,0,
PSNLTGAEIYSLSSTPR,ph,T,236,true,"atm and atr DNA damage response",88,25561503,"MASCOT Score",43.0000000,0.9950000,,,,,-0.0500000
PSNLTGAEIYSLSSTPR,ph,T,236,true,"Tissue atlas Arabidopsis - ProteomicsDB",114,32188942,"MaxQuant score",371.3700000,0.9030080,,,,0,
LSNFGPADLYSVQSSR,ph,S,259,true,"atm and atr DNA damage response",88,25561503,"MASCOT Score",29.0000000,1.0000000,,,,,0.4800000
LSNFGPADLYSVQSSR,ph,S,259,true,"Tissue atlas Arabidopsis - ProteomicsDB",114,32188942,"MaxQuant score",170.6100000,1.0000000,,,,3.1499699470509E-19,
LSNFGPADLYSVQSSR,ph,S,271,true,"Tissue atlas Arabidopsis - ProteomicsDB",114,32188942,"MaxQuant score",143.6900000,0.8272370,,,,5.404990175342E-22,
GPTPRPSNFEENNAVK,ph,T,276,true,"atm and atr DNA damage response",88,25561503,"MASCOT Score",28.0000000,1.0000000,,,,,-0.5900000
GPTPRPSNFEENNAVK,ph,T,276,true,"Tissue atlas Arabidopsis - ProteomicsDB",114,32188942,"MaxQuant score",173.4300000,1.0000000,,,,9.5844696620761E-22,
GPTPRPSNFEENNAVK,ph,S,280,true,"atm and atr DNA damage response",88,25561503,"MASCOT Score",41.0000000,1.0000000,,,,,-0.4600000
GPTPRPSNFEENNAVK,ph,S,280,true,"Tissue atlas Arabidopsis - ProteomicsDB",114,32188942,"MaxQuant score",167.0500000,1.0000000,,,,9.5844696620761E-22,
KSGGDDIGGLDSGEGEREIEK,ph,S,395,true,"Phytohormone-responsive phosphoproteins",34,20374526,"MASCOT Score",82.0000000,,,,,,
KSGGDDIGGLDSGEGEREIEK,ph,S,395,true,"Chloroplast kinase substrates",60,19376835,"MASCOT Score",41.6900000,,,,,,-1.8093900
KSGGDDIGGLDSGEGEREIEK,ph,S,395,true,"atm and atr DNA damage response",88,25561503,"MASCOT Score",35.0000000,1.0000000,,,,,-0.1900000
KSGGDDIGGLDSGEGEREIEK,ph,S,395,true,"TOR Kinase and ABA Receptor",100,29290610,XCorr,3.2681639,1.0000000,,,,0.00027399999089539,
KSGGDDIGGLDSGEGEREIEK,ph,S,395,true,"Touch-induced phosphorylation: 40s touch vs untouc",136,30291188,"MASCOT score",95.5300000,,0.1084382,0.6607964,NO,,3.9674003
SGGDDIGGLDSGEGEREIEK,ph,S,395,true,"TOR Kinase and ABA Receptor",100,29290610,XCorr,3.9707541,1.0000000,,,,0.0090119997039437,
KSGGDDIGGLDSGEGER,ph,S,395,true,"STN8 phosphoproteome",38,21768351,"MASCOT Score",130.0100000,,,,,,-2.1358300
KSGGDDIGGLDSGEGER,ph,S,395,true,"Chloroplast kinase substrates",60,19376835,"MASCOT Score",131.4600000,,,,,,-0.7830090
KSGGDDIGGLDSGEGER,ph,S,395,true,"atm and atr DNA damage response",88,25561503,"MASCOT Score",82.0000000,1.0000000,,,,,-0.1700000
SGGDDIGGLDSGEGER,ph,S,395,true,"STN8 phosphoproteome",38,21768351,"MASCOT Score",97.9300000,,,,,,-0.8849680
SGGDDIGGLDSGEGER,ph,S,395,true,"Chloroplast kinase substrates",60,19376835,"MASCOT Score",92.4000000,,,,,,-1.0972500
SGGDDIGGLDSGEGER,ph,S,395,true,"atm and atr DNA damage response",88,25561503,"MASCOT Score",79.0000000,1.0000000,,,,,-0.2200000
SGGDDIGGLDSGEGER,ph,S,395,true,"Tissue atlas Arabidopsis - ProteomicsDB",114,32188942,"MaxQuant score",240.1900000,1.0000000,,,,0,
KSGGDDIGGLDSGEGEREIEK,ph,S,405,true,"Tissue atlas Arabidopsis - ProteomicsDB",114,32188942,"MaxQuant score",63.9670000,1.0000000,,,,8.5236097220331E-5,
MGSNSTAELEAAGGDGGGNNGTHMPPTSVMTR,ph,S,424,true,"Tissue atlas Arabidopsis - ProteomicsDB",114,32188942,"MaxQuant score",80.7290000,0.9666590,,,,9.7735697573292E-13,
MGSNSTAELEAAGGDGGGNNGTHMPPTSVMTR,ph,S,426,true,"Tissue atlas Arabidopsis - ProteomicsDB",114,32188942,"MaxQuant score",95.5270000,0.9223270,,,,3.5145999115986E-25,
