Peptide,PTM,ModifiedAA,ModifiedPosition,PeptideUniqueToGene,ExperimentDesc,ExpID,PubmedID,ScoreType,IdentScore,LocProb,Log2FChange,PQ-val,QuantSig,PEP,MassErrorPPM
VESKVVVPESVLKKR,nt,V,2,true,"Arg/N-end rule pathway Roots",80,25728785,"MASCOT Score",58.6800000,,,,,5.9419999161037E-6,
VESKVVVPESVLKKR,nt,V,2,true,"FtsH12 N-terminome: WT / FtsH12 knockdown miRNA",118,33216923,"MaxQuant score",233.2400000,,-0.3070301,0.0460505,NO,0,
VESKVVVPESVLK,nt,V,2,true,"Arg/N-end rule pathway Roots",80,25728785,"MASCOT Score",25.7500000,,,,,0.0019099999917671,
VESKVVVPESVL,nt,V,2,true,"Arg/N-end rule seed, prt6 vs. Wt",99,29168982,"MASCOT Score",40.0400000,,0.1176377,0.1653530,NO,0.028759999200702,-1.9225569
VESKVVVPES,nt,V,2,true,"N-term acetylation drought responses",5,26184543,,,,,,,,
VESKVVVPE,nt,V,2,true,"Arg/N-end rule seed, prt6 vs. Wt",99,29168982,"MASCOT Score",33.0500000,,0.0525245,0.5260463,NO,0.18490000069141,-1.6794255
VESKVVVPE,nt,V,2,true,"HUNTER N-terminome: legumain, GluC and trypsin",119,31951383,"MaxQuant score",104.2000000,,,,,,
VESKVVVPESVLKK,nta,V,2,true,"Arg/N-end rule pathway Roots",80,25728785,"MASCOT Score",27.0900000,,,,,0.022159999236465,
VESKVVVPESVLK,nta,V,2,true,"Arg/N-end rule pathway Roots",80,25728785,"MASCOT Score",40.7900000,,,,,0.020080000162125,
SKVVVPE,nt,S,4,false,"Arg/N-end rule seed, prt6 vs. Wt",99,29168982,"MASCOT Score",30.0200000,,,,,0.050080001354218,-0.2608911
SKVVVPE,nta,S,4,false,"Arg/N-end rule seed, prt6 vs. Wt",99,29168982,"MASCOT Score",30.0200000,,0.0025646,0.9909946,NO,0.050080001354218,-0.2608911
VESKVVVPESVLK,ph,S,4,true,"Tissue atlas Arabidopsis - ProteomicsDB",114,32188942,"MaxQuant score",168.7400000,1.0000000,,,,1.0580600252278E-14,
VVVPESVLKKR,nt,V,6,true,"Metacaspase9 substrates - Col-0 / mc9",51a,23964026,"MASCOT Score",57.0000000,,3.1175371,,NO,,-1.0169808
VVVPESVLKKR,nt,V,6,true,"Metacaspase9 substrates - 35S:MC9 / mc9",51b,23964026,"MASCOT Score",54.0000000,,3.1042175,,NO,,-3.3899280
VVVPESVLK,ph,S,11,false,"Tissue atlas Arabidopsis - ProteomicsDB",114,32188942,"MaxQuant score",128.5100000,1.0000000,,,,0.00015111800166778,
QNVEAAKKK,ac,K,34,true,"Quantitative Acetylproteomics",101,29440448,,,,,,,,
AEQYSKEYAEK,ub,K,53,true,"upl3 mutant / wildtype",168,35926874,"MaxQuant score",117.7900000,1.0000000,-0.0892673,,,2.1591400582111E-5,0.3651300
EYAEKEK,ac,K,58,true,"Quantitative Acetylproteomics",101,29440448,,,,,,,,
EKELISLKR,ac,K,66,true,"Quantitative Acetylproteomics",101,29440448,,,,,,,,
LKGGFYVDPEAK,ac,K,72,false,"Quantitative Acetylproteomics",101,29440448,,,,,,,,
AIDPKTKKILQLL,nt,A,94,false,"Arabidopsis translation initiation landscape - NT",167b,35069635,,,,,,,,
QIFNGVFLK,ac,K,118,false,"Quantitative Acetylproteomics",101,29440448,,,,,,,,
ELIYKRGYGKLNHQRIALT,nt,E,146,false,"Arabidopsis translation initiation landscape - NT",167b,35069635,,,,,,,,
GYGKLNHQR,nt,G,152,false,"Arabidopsis translation initiation landscape - NT",167b,35069635,,,,,,,,
TDNSIVEQ,nt,T,164,true,"N-terminal ChaFRADIC",92,26010716,"MASCOT Score",22.9100000,,,,,0.0093099996447563,
HGIICTEDLIHEILTVGPHFK,so,C,180,true,"S-sulfenylation site detection using YAP1C",110,32714340,,,,,,,,
APLGGLKK,ac,K,215,false,"Quantitative Acetylproteomics",101,29440448,,,,,,,,
HYVEGGDAGNR,nt,H,220,false,"Arg/N-end rule seed, prt6 vs. Wt",99,29168982,"MASCOT Score",28.0100000,,,,,0.049649998545647,-1.3448890
