Peptide,PTM,ModifiedAA,ModifiedPosition,PeptideUniqueToGene,ExperimentDesc,ExpID,PubmedID,ScoreType,IdentScore,LocProb,Log2FChange,PQ-val,QuantSig,PEP,MassErrorPPM
RISLDGIAALCEHSK,ph,S,28,true,"Tissue atlas Arabidopsis - ProteomicsDB",114,32188942,"MaxQuant score",85.8840000,1.0000000,,,,3.126990122837E-5,
FGLSDDEAEDIAMDDAPGLGDPVGLDGKK,ph,S,193,true,"SnRK2 protein kinase substrates",85,23776212,XCorr,4.8747659,1.0000000,,,,1.6396899791849E-15,
FGLSDDEAEDIAMDDAPGLGDPVGLDGKK,ph,S,193,true,"Phospho cell culture sucrose/TOR",109,30833711,,,1.0000000,,,,,
FGLSDDEAEDIAMDDAPGLGDPVGLDGKK,ph,S,193,true,"Tissue atlas Arabidopsis - ProteomicsDB",114,32188942,"MaxQuant score",262.4700000,1.0000000,,,,0,
FGLSDDEAEDIAMDDAPGLGDPVGLDGK,ph,S,193,true,"SnRK2 protein kinase substrates",85,23776212,XCorr,3.5573454,1.0000000,,,,4.5999800590835E-7,
FGLSDDEAEDIAMDDAPGLGDPVGLDGK,ph,S,193,true,"TOR Kinase and ABA Receptor",100,29290610,XCorr,5.1682100,1.0000000,,,,3.1209998269333E-5,
KVADIDEEDQMETSELELSHSLPAHLGLDPEK,ph,S,231,true,"Tissue atlas Arabidopsis - ProteomicsDB",114,32188942,"MaxQuant score",207.6200000,0.7846080,,,,0,
MLMFPNEDEDESEDFR,ph,S,266,true,"Tissue atlas Arabidopsis - ProteomicsDB",114,32188942,"MaxQuant score",161.1900000,1.0000000,,,,6.9024003364077E-14,
EQTSHLMTSLTK,ph,T,278,true,"Tissue atlas Arabidopsis - ProteomicsDB",114,32188942,"MaxQuant score",97.2970000,0.8515010,,,,0.00013145500270184,
LMYAASDNEEDVMQDVKEDSAK,ph,S,523,true,"Arabidopsis root NAA phosphoproteome",18a,27643528,"MaxQuant Score",57.4840000,0.9990000,,,,1.5850000636419E-5,0.2510000
LMYAASDNEEDVMQDVKEDSAK,ph,S,523,true,"Chloroplast kinase substrates",60,19376835,"MASCOT Score",44.3000000,,,,,,-1.0572100
LMYAASDNEEDVMQDVKEDSAK,ph,S,523,true,"LAXIC - ABA stress",84a,23660473,XCorr,3.5200000,0.9610000,,,,0.082500599324703,
LMYAASDNEEDVMQDVKEDSAK,ph,S,523,true,"SnRK2 protein kinase substrates",85,23776212,XCorr,3.4658175,1.0000000,,,,0.021040199324489,
LMYAASDNEEDVMQDVKEDSAK,ph,S,523,true,"Phospho cell culture sucrose/TOR",109,30833711,,,1.0000000,,,,,
LMYAASDNEEDVMQDVKEDSAK,ph,S,523,true,"Tissue atlas Arabidopsis - ProteomicsDB",114,32188942,"MaxQuant score",441.8000000,1.0000000,,,,0,
LMYAASDNEEDVMQDVK,ph,S,523,true,"Large-scale phosphorylation discovery",44,23111157,XCorr,7.0220000,,,,,,
LMYAASDNEEDVMQDVK,ph,S,523,true,"Tyrosine phosphorylation in Arabidopsis",59,18463617,"MASCOT Score",73.0000000,,,,,,-1.2274106
LMYAASDNEEDVMQDVK,ph,S,523,true,"Chloroplast kinase substrates",60,19376835,"MASCOT Score",89.1400000,,,,,,-1.2499300
LMYAASDNEEDVMQDVK,ph,S,523,true,"srk2dei ABA signaling phopshoproteomics",83,23572148,"MASCOT Score",99.0000000,,,,,,-0.0006000
LMYAASDNEEDVMQDVK,ph,S,523,true,"LAXIC - mannitol vs control",84b,23660473,XCorr,4.7700000,1.0000000,,,,0.00047496499610133,
LMYAASDNEEDVMQDVK,ph,S,523,true,"SnRK2 protein kinase substrates",85,23776212,XCorr,5.0307288,1.0000000,,,,0.00034977900213562,
LMYAASDNEEDVMQDVK,ph,S,523,true,"atm and atr DNA damage response",88,25561503,"MASCOT Score",52.0000000,0.9990000,,,,,-0.0400000
LMYAASDNEEDVMQDVK,ph,S,523,true,"Brassinosteroid-Regulated Phosphorylation Dynamics",94,26187819,"MaxQuant Score",166.9100000,1.0000000,,,,3.4880000335202E-36,-4.7220000
LMYAASDNEEDVMQDVK,ph,S,523,true,"TOR Kinase and ABA Receptor",100,29290610,XCorr,7.1926532,1.0000000,,,,2.4979998625163E-10,
LMYAASDNEEDVMQDVK,ph,S,523,true,"Lateral root-induction - NAA vs control",106,23328941,"MASCOT Score",71.0000000,,,,,,
EDSAKIDTEALPLIR,ph,S,537,true,"Tissue atlas Arabidopsis - ProteomicsDB",114,32188942,"MaxQuant score",111.0900000,0.9948780,,,,1.437059950149E-6,
