Peptide,PTM,ModifiedAA,ModifiedPosition,PeptideUniqueToGene,ExperimentDesc,ExpID,PubmedID,ScoreType,IdentScore,LocProb,Log2FChange,PQ-val,QuantSig,PEP,MassErrorPPM
AGNKDSSWDDIKNEGIDLEK,ph,S,7,true,"Tissue atlas Arabidopsis - ProteomicsDB",114,32188942,"MaxQuant score",217.2600000,0.9354100,,,,0,
DSSWDDIK,ph,S,8,true,"Tissue atlas Arabidopsis - ProteomicsDB",114,32188942,"MaxQuant score",266.4600000,0.9992260,,,,0,
LSQQGAITKR,ac,K,317,false,"Quantitative Acetylproteomics",101,29440448,,,,,,,,
LSQQGAITKR,ub,K,317,false,"Ubiquitination Membrane Proteins",120,33585938,,,,,,,,
MTAIEEMAGMDVLCSDK,ph,T,320,false,"Brassinosteroid-Regulated Phosphorylation Dynamics",94,26187819,"MaxQuant Score",58.9140000,1.0000000,,,,0.01799999922514,-0.0650000
MTAIEEMAGMDVLCSDK,ph,S,333,false,"Phosphorylation in N starvation",63,22060019,"MASCOT Score",99.0000000,,,,,,-1.1356600
MTAIEEMAGMDVLCSDK,ph,S,333,false,"Brassinosteroid-Regulated Phosphorylation Dynamics",94,26187819,"MaxQuant Score",58.9140000,1.0000000,,,,0.01799999922514,-0.0650000
RMTAIEEMAGMDVLCSDKTGTLTLNK,ub,K,335,false,"Arabidopsis ubiquitination by TUBEs",2,23667124,,,,,,,,
TGTLTLNK,ph,T,340,false,"Tissue atlas Arabidopsis - ProteomicsDB",114,32188942,"MaxQuant score",123.4200000,0.9975070,,,,0.0081411302089691,
MITGDQLAIGK,ph,T,516,false,"Phosphorylation Early Elicitor Signaling",23,17317660,,,,,,,,
ADGFAGVFPEHKYEIVK,ac,K,574,false,"Histone deacetylases substrates - hda14 vs WT",98e,29061669,"MaxQuant Score",46.2000000,1.0000000,-0.4210000,0.8375293,NO,0.00098000001162291,
ADGFAGVFPEHKYEIVK,ac,K,574,false,"Quantitative Acetylproteomics",101,29440448,,,,,,,,
HICGMTGDGVNDAPALK,sno,C,588,false,"hot5-4 / wildtype, FAT-switch S-nitrosoproteome",169,37277371,,,,,,,,
TAFTSKKDYGK,ph,S,867,true,"Tissue atlas Arabidopsis - ProteomicsDB",114,32188942,"MaxQuant score",89.5070000,0.9953350,,,,0.00015101299504749,
TLHGLQPAQTSDMFNDK,ph,T,886,true,"Tissue atlas Arabidopsis - ProteomicsDB",114,32188942,"MaxQuant score",204.2300000,1.0000000,,,,0,
TLHGLQPAQTSDMFNDK,ph,T,895,true,"Tissue atlas Arabidopsis - ProteomicsDB",114,32188942,"MaxQuant score",120.4100000,0.9411720,,,,9.6198804477865E-10,
TLHGLQPAQTSDMFNDK,ph,S,896,true,"Tissue atlas Arabidopsis - ProteomicsDB",114,32188942,"MaxQuant score",210.3900000,0.9891430,,,,0,
TLHGLQPAQTSDMFNDKSTYR,ph,S,903,true,"Tissue atlas Arabidopsis - ProteomicsDB",114,32188942,"MaxQuant score",199.8100000,0.8063020,,,,0,
ELSEIADQAK,ph,S,909,true,"Tissue atlas Arabidopsis - ProteomicsDB",114,32188942,"MaxQuant score",155.5300000,1.0000000,,,,8.9482000475982E-7,
GHVESVVK,ph,S,936,false,"Pollen phosphoproteome Arabidopsis",43,22631563,"MASCOT Score",44.3900000,,,,,,-0.4803930
GHVESVVK,ph,S,936,false,"atm and atr DNA damage response",88,25561503,"MASCOT Score",35.0000000,1.0000000,,,,,-3.1400000
GHVESVVK,ph,S,936,false,"TOR Kinase and ABA Receptor",100,29290610,XCorr,2.6575863,1.0000000,,,,0.074850000441074,
GHVESVVK,ph,S,936,false,"Tissue atlas Arabidopsis - ProteomicsDB",114,32188942,"MaxQuant score",169.9300000,1.0000000,,,,0.00052241201046854,
GLDIEAIQQHYTL,ph,Y,952,true,"Tissue atlas Arabidopsis - ProteomicsDB",114,32188942,"MaxQuant score",175.3300000,0.9827160,,,,6.3434098367132E-15,
GLDIEAIQQHYTL,ph,T,953,true,"Tissue atlas Arabidopsis - ProteomicsDB",114,32188942,"MaxQuant score",313.9000000,1.0000000,,,,0,
