Peptide,PTM,ModifiedAA,ModifiedPosition,PeptideUniqueToGene,ExperimentDesc,ExpID,PubmedID,ScoreType,IdentScore,LocProb,Log2FChange,PQ-val,QuantSig,PEP,MassErrorPPM
VLTNAGDQAVSVKASVSQKVIEEE,nt,V,42,true,"Arabidopsis translation initiation landscape - NT",167b,35069635,,,,,,,,
VLTNAGDQAVSVKASVSQKVIE,nt,V,42,true,"Arg/N-end rule seed, prt6 vs. Wt",99,29168982,"MASCOT Score",30.4300000,,,,,9.3779997656362E-11,-1.9752951
VLTNAGDQAVSVKASVSQKVIEEE,nta,V,42,true,"HUNTER N-terminome: legumain, GluC and trypsin",119,31951383,"MaxQuant score",43.1620000,,,,,,
VLTNAGDQAVSVKASVSQKVIEE,nta,V,42,true,"HUNTER N-terminome: legumain, GluC and trypsin",119,31951383,"MaxQuant score",70.9170000,,,,,,
VLTNAGDQAVSVKASVSQKVIE,nta,V,42,true,"Arg/N-end rule seed, prt6 vs. Wt",99,29168982,"MASCOT Score",30.4300000,,0.1700096,0.8384490,NO,9.3779997656362E-11,-1.9752951
VLTNAGDQAVSVKASVSQKVIE,nta,V,42,true,"HUNTER N-terminome: legumain, GluC and trypsin",119,31951383,"MaxQuant score",64.8430000,,,,,,
VLTNAGDQAVSVK,nta,V,42,true,"Characterization plant N-terminal acetylation",6,22223895,"MASCOT Score",95.9500000,,,,,,
SVSQKVIEEEAKVIVGTYAR,nt,S,56,true,"Stromal N-terminome",96,26371235,"MASCOT Score",37.1800000,,,,,,
QAGVLAHVSNVYYTIPQIE,nt,Q,122,true,"HUNTER N-terminome: legumain, GluC and trypsin",119,31951383,"MaxQuant score",78.4860000,,,,,,
VFFCNSGTEANEAAIK,sno,C,157,true,"Site-specific nitrosomeproteomic id - gsnor1-3",90b,25699590,XCorr,3.2200000,,,,,9.9999997473788E-5,-6.9300000
VFFCNSGTEANEAAIK,so,C,157,true,"S-sulfenylation site detection using YAP1C",110,32714340,,,,,,,,
TLGALALTSKEQYR,nt,T,200,true,"Arabidopsis translation initiation landscape - NT",167b,35069635,,,,,,,,
TLGALALTSKEQYR,ac,K,209,true,"Histone deacetylases- hda14 vs WT (low light)",98c,29061669,"MaxQuant Score",198.8100000,1.0000000,0.2240000,0.9885531,NO,1.8000000361756E-13,
TLGALALTSKEQYR,ac,K,209,true,"Histone deacetylases substrates - hda14 vs WT",98e,29061669,"MaxQuant Score",228.8000000,1.0000000,0.1510000,0.8016781,NO,0,
