Peptide,PTM,ModifiedAA,ModifiedPosition,PeptideUniqueToGene,ExperimentDesc,ExpID,PubmedID,ScoreType,IdentScore,LocProb,Log2FChange,PQ-val,QuantSig,PEP,MassErrorPPM
LIVKSYETK,ac,K,18,true,"Quantitative Acetylproteomics",101,29440448,,,,,,,,
DLSGFVETR,ph,S,128,true,"Tissue atlas Arabidopsis - ProteomicsDB",114,32188942,"MaxQuant score",101.3900000,1.0000000,,,,0.0010660500265658,
QQLLTLKPNHR,nt,Q,135,true,"HUNTER N-terminome: legumain, GluC and trypsin",119,31951383,"MaxQuant score",,,,,,,
LSYKEQEVSLLSK,ub,K,226,true,"upl3 mutant / wildtype",168,35926874,"MaxQuant score",132.9700000,1.0000000,2.4494293,0.2500200,NO,1.1550700396157E-9,-1.1902000
LEEANKLYR,ub,K,244,true,"Arabidopsis ubiquitination COFRADIC",40,26744219,"MaxQuant Score",74.9200000,1.0000000,,,,0.0099999997764826,1.2600000
GQYDVALCK,ox,C,401,true,"OxiTRAQ Arabidopsis - 5 mM H2O2 versus control",47,24376095,,,,-0.2241008,0.0894524,NO,,
GQYDVALCK,sno,C,401,true,"hot5-4 / wildtype, FAT-switch S-nitrosoproteome",169,37277371,,,,0.2216452,0.0604812,NO,,
YINSECVK,sno,C,454,true,"hot5-4 / wildtype, FAT-switch S-nitrosoproteome",169,37277371,,,,,,,,
KQKKAEAR,ac,K,599,true,"Histone deacetylases - hda14 vs WT (thylakoids)",98d,29061669,"MaxQuant Score",60.0000000,1.0000000,-0.0790000,0.9862795,NO,0.0049999998882413,
KQKKAEAR,ac,K,601,true,"Histone deacetylases - hda14 vs WT (thylakoids)",98d,29061669,"MaxQuant Score",60.0000000,1.0000000,-0.0790000,0.9862795,NO,0.0049999998882413,
KQKKAEAR,ac,K,602,true,"Histone deacetylases - hda14 vs WT (thylakoids)",98d,29061669,"MaxQuant Score",60.0000000,1.0000000,-0.0790000,0.9862795,NO,0.0049999998882413,
EAESKSEESTASGASK,ac,K,614,true,"Quantitative Acetylproteomics",101,29440448,,,,,,,,
EAESKSEESTASGASK,ph,S,615,true,"Tissue atlas Arabidopsis - ProteomicsDB",114,32188942,"MaxQuant score",70.6800000,0.9744800,,,,0.00092335499357432,
SEESTASGASK,ph,S,624,true,"atm and atr DNA damage response",88,25561503,"MASCOT Score",77.0000000,1.0000000,,,,,-1.8300000
LKDCIAVHTLLDTVLLDSQAASR,so,C,813,true,"S-sulfenylation site detection using YAP1C",110,32714340,,,,,,,,
HCSLMPDSVYNSSR,sno,C,852,true,"Site-specific nitrosomeproteomic id - gsnor1-3",90b,25699590,XCorr,2.9900000,,,,,0.1427000015974,-7.0000000
HCSLMPDSVYNSSR,ph,S,862,true,"Tissue atlas Arabidopsis - ProteomicsDB",114,32188942,"MaxQuant score",163.4100000,0.9522540,,,,5.9832597210097E-11,
KSNENGDTPNHPMGQTELSDGQLEAFK,ph,S,866,true,"Tissue atlas Arabidopsis - ProteomicsDB",114,32188942,"MaxQuant score",349.8800000,0.9999940,,,,0,
SNENGDTPNHPMGQTELSDGQLEAFK,ph,S,866,true,"TOR Kinase and ABA Receptor",100,29290610,XCorr,3.0529826,0.9889000,,,,0.0092380000278354,
KSNENGDTPNHPMGQTELSDGQLEAFK,ph,T,872,true,"Tissue atlas Arabidopsis - ProteomicsDB",114,32188942,"MaxQuant score",216.7400000,0.9998980,,,,0,
KSNENGDTPNHPMGQTELSDGQLEAFK,ph,T,880,true,"Tissue atlas Arabidopsis - ProteomicsDB",114,32188942,"MaxQuant score",196.0600000,0.9987050,,,,0,
KSNENGDTPNHPMGQTELSDGQLEAFK,ph,S,883,true,"SnRK2 protein kinase substrates",85,23776212,XCorr,3.4332919,0.8930000,,,,9.0253497546655E-6,
KSNENGDTPNHPMGQTELSDGQLEAFK,ph,S,883,true,"Tissue atlas Arabidopsis - ProteomicsDB",114,32188942,"MaxQuant score",172.3400000,0.9989030,,,,0,
SNENGDTPNHPMGQTELSDGQLEAFK,ph,S,883,true,"TOR Kinase and ABA Receptor",100,29290610,XCorr,5.6357250,0.8384000,,,,1.039000039782E-6,
SNENGDTPNHPMGQTELSDGQLEAFK,ph,S,883,true,"Phospho cell culture sucrose/TOR",109,30833711,,,0.9868490,,,,,
