Peptide,PTM,ModifiedAA,ModifiedPosition,PeptideUniqueToGene,ExperimentDesc,ExpID,PubmedID,ScoreType,IdentScore,LocProb,Log2FChange,PQ-val,QuantSig,PEP,MassErrorPPM
VGSSNSLAGLQDHLKLAR,nt,V,2,true,"Arabidopsis translation initiation landscape - NT",167b,35069635,,,,,,,,
VGSSNSLAGLQD,nt,V,2,true,"Arg/N-end rule seed, prt6 vs. Wt",99,29168982,"MASCOT Score",67.2900000,,-0.0328068,0.8961090,NO,6.9639997946069E-7,-2.7282656
VGSSNSLAGLQDHLK,ph,S,4,true,"Tissue atlas Arabidopsis - ProteomicsDB",114,32188942,"MaxQuant score",208.3800000,0.9944370,,,,2.8025969286496E-45,
VGSSNSLAGLQDHLK,ph,S,7,true,"Tissue atlas Arabidopsis - ProteomicsDB",114,32188942,"MaxQuant score",72.4210000,0.9098230,,,,0.00010361099703005,
AFKEAPTGR,ub,K,82,true,"Arabidopsis ubiquitination COFRADIC",40,26744219,"MaxQuant Score",73.8850000,1.0000000,,,,0.010999999940395,-0.8260000
RAASPPINTK,ph,S,92,true,"STN8 phosphoproteome",38,21768351,"MASCOT Score",57.0300000,,,,,,0.5430010
RAASPPINTK,ph,S,92,true,"Chloroplast kinase substrates",60,19376835,"MASCOT Score",42.6400000,,,,,,0.5430010
RAASPPINTK,ph,S,92,true,"SnRK2 protein kinase substrates",85,23776212,XCorr,2.5391784,1.0000000,,,,0.074402399361134,
RAASPPINTK,ph,S,92,true,"atm and atr DNA damage response",88,25561503,"MASCOT Score",34.0000000,1.0000000,,,,,0.1100000
RAASPPINTK,ph,S,92,true,"TOR Kinase and ABA Receptor",100,29290610,XCorr,3.1675789,1.0000000,,,,0.00023059999512043,
RAASPPINTK,ph,S,92,true,"Phospho cell culture sucrose/TOR",109,30833711,,,1.0000000,,,,,
RAASPPINTK,ph,S,92,true,"Tissue atlas Arabidopsis - ProteomicsDB",114,32188942,"MaxQuant score",199.4100000,1.0000000,,,,2.2321300217247E-14,
AASPPINTK,ph,S,92,true,"atm and atr DNA damage response",88,25561503,"MASCOT Score",37.0000000,1.0000000,,,,,1.3200000
KSPQDGAWAR,ph,S,147,true,"atm and atr DNA damage response",88,25561503,"MASCOT Score",32.0000000,1.0000000,,,,,-0.9700000
KSPQDGAWAR,ph,S,147,true,"Tissue atlas Arabidopsis - ProteomicsDB",114,32188942,"MaxQuant score",91.2800000,1.0000000,,,,0.00084556301590055,
SPQDGAWAR,ph,S,147,true,"TOR Kinase and ABA Receptor",100,29290610,XCorr,2.4866216,1.0000000,,,,0.002858999883756,
SNKAESMNGDAEDGK,ph,S,199,true,"atm and atr DNA damage response",88,25561503,"MASCOT Score",34.0000000,1.0000000,,,,,-1.1800000
AESMNGDAEDGK,ph,S,199,true,"atm and atr DNA damage response",88,25561503,"MASCOT Score",67.0000000,1.0000000,,,,,-0.8800000
