Peptide,PTM,ModifiedAA,ModifiedPosition,PeptideUniqueToGene,ExperimentDesc,ExpID,PubmedID,ScoreType,IdentScore,LocProb,Log2FChange,PQ-val,QuantSig,PEP,MassErrorPPM
SDQEEDDLEDGFSELEGSK,ph,S,70,true,"STN8 phosphoproteome",38,21768351,"MASCOT Score",55.1500000,,,,,,-1.2305800
SDQEEDDLEDGFSELEGSK,ph,S,70,true,"Tyrosine phosphorylation in Arabidopsis",59,18463617,"MASCOT Score",112.0000000,,,,,,-1.3135107
SDQEEDDLEDGFSELEGSK,ph,S,70,true,"Chloroplast kinase substrates",60,19376835,"MASCOT Score",42.1100000,,,,,,-1.2305800
SDQEEDDLEDGFSELEGSK,ph,S,70,true,"srk2dei ABA signaling phopshoproteomics",83,23572148,"MASCOT Score",96.0000000,,,,,,-0.0013000
SDQEEDDLEDGFSELEGSK,ph,S,70,true,"LAXIC - mannitol vs control",84b,23660473,XCorr,6.1700000,1.0000000,,,,4.3000000791257E-16,
SDQEEDDLEDGFSELEGSK,ph,S,70,true,"Brassinosteroid-Regulated Phosphorylation Dynamics",94,26187819,"MaxQuant Score",107.9400000,1.0000000,,,,0.00033750000875443,2.2750000
SDQEEDDLEDGFSELEGSK,ph,S,70,true,"TOR Kinase and ABA Receptor",100,29290610,XCorr,6.2211695,1.0000000,,,,5.7610001213959E-9,
SDQEEDDLEDGFSELEGSK,ph,S,70,true,"Phospho cell culture sucrose/TOR",109,30833711,,,1.0000000,,,,,
SDQEEDDLEDGFSELEGSK,ph,S,70,true,"Tissue atlas Arabidopsis - ProteomicsDB",114,32188942,"MaxQuant score",329.7800000,1.0000000,,,,0,
SDQEEDDLEDGFSELEGSK,ph,S,82,true,"Tyrosine phosphorylation in Arabidopsis",59,18463617,"MASCOT Score",68.0000000,,,,,,-1.4040978
SDQEEDDLEDGFSELEGSK,ph,S,82,true,"srk2dei ABA signaling phopshoproteomics",83,23572148,"MASCOT Score",97.0000000,,,,,,-0.0005000
SDQEEDDLEDGFSELEGSK,ph,S,82,true,"LAXIC - ABA stress",84a,23660473,XCorr,5.9900000,1.0000000,,,,0.0010237300302833,
SDQEEDDLEDGFSELEGSK,ph,S,82,true,"SnRK2 protein kinase substrates",85,23776212,XCorr,5.0049443,1.0000000,,,,7.7905297075631E-6,
SDQEEDDLEDGFSELEGSK,ph,S,82,true,"Brassinosteroid-Regulated Phosphorylation Dynamics",94,26187819,"MaxQuant Score",107.9400000,1.0000000,,,,0.00033750000875443,2.2750000
SDQEEDDLEDGFSELEGSK,ph,S,82,true,"TOR Kinase and ABA Receptor",100,29290610,XCorr,6.1502776,1.0000000,,,,1.08300000079E-7,
SDQEEDDLEDGFSELEGSK,ph,S,82,true,"Lateral root-induction - NAA vs control",106,23328941,"MASCOT Score",78.0000000,,,,,,
SDQEEDDLEDGFSELEGSK,ph,S,82,true,"Phospho cell culture sucrose/TOR",109,30833711,,,0.9999990,,,,,
SDQEEDDLEDGFSELEGSK,ph,S,82,true,"Col-0 callus - FC Col-0 vs. Col-0 Xray",111a,31410901,,88.1300000,,0.3753208,0.0000000,NO,,0.0549434
SDQEEDDLEDGFSELEGSK,ph,S,82,true,"Col-0 X-ray callus - FC Col-0 vs. Col-0 Xray",111b,31410901,,88.1300000,,0.3753208,0.0000000,NO,,0.0549434
SDQEEDDLEDGFSELEGSK,ph,S,82,true,"atm callus - FC atm vs. atm Xray",111c,31410901,,88.1300000,,0.8770788,0.0000000,NO,,0.0549434
SDQEEDDLEDGFSELEGSK,ph,S,82,true,"atm-3 X-ray callus - FC atm vs. atm Xray",111d,31410901,,88.1300000,,0.8770788,0.0000000,NO,,0.0549434
SDQEEDDLEDGFSELEGSK,ph,S,82,true,"Tissue atlas Arabidopsis - ProteomicsDB",114,32188942,"MaxQuant score",454.6700000,1.0000000,,,,0,
SGQGSTSSDEDEGKLSADEEEEEELDLIETDVSRK,ph,T,94,true,"Brassinosteroid-Regulated Phosphorylation Dynamics",94,26187819,"MaxQuant Score",90.2990000,0.8450000,,,,2.1079999612539E-7,-0.9240000
SGQGSTSSDEDEGKLSADEEEEEELDLIETDVSRK,ph,S,95,true,"Brassinosteroid-Regulated Phosphorylation Dynamics",94,26187819,"MaxQuant Score",90.2990000,0.9110000,,,,1.1080000206221E-7,0.7230000
SGQGSTSSDEDEGKLSADEEEEEELDLIETDVSRK,ph,S,96,true,"Brassinosteroid-Regulated Phosphorylation Dynamics",94,26187819,"MaxQuant Score",90.2990000,0.9110000,,,,1.1080000206221E-7,0.7230000
SGQGSTSSDEDEGKLSADEEEEEELDLIETDVSRK,ph,S,104,true,"Brassinosteroid-Regulated Phosphorylation Dynamics",94,26187819,"MaxQuant Score",90.2990000,1.0000000,,,,1.1080000206221E-7,1.2980000
SGQGSTSSDEDEGKLSADEEEEEELDLIETDVSR,ph,S,104,true,"Col-0 callus - FC Col-0 vs. Col-0 Xray",111a,31410901,,70.2600000,,0.9945009,0.0000000,NO,,1.8255553
SGQGSTSSDEDEGKLSADEEEEEELDLIETDVSR,ph,S,104,true,"Col-0 X-ray callus - FC Col-0 vs. Col-0 Xray",111b,31410901,,70.2600000,,0.9945009,0.0000000,NO,,1.8255553
SGQGSTSSDEDEGKLSADEEEEEELDLIETDVSR,ph,S,104,true,"atm callus - FC atm vs. atm Xray",111c,31410901,,70.2600000,,3.4568363,0.0000000,NO,,1.8255553
SGQGSTSSDEDEGKLSADEEEEEELDLIETDVSR,ph,S,104,true,"atm-3 X-ray callus - FC atm vs. atm Xray",111d,31410901,,70.2600000,,3.4568363,0.0000000,NO,,1.8255553
LSADEEEEEELDLIETDVSR,ph,S,104,true,"Phospho cell culture sucrose/TOR",109,30833711,,,1.0000000,,,,,
GEACMQK,sno,C,218,true,"hot5-4 / wildtype, FAT-switch S-nitrosoproteome",169,37277371,,,,0.8103961,0.0004468,YES,,
TLLANCVAAGNVK,ox,C,239,true,"Redox kickstart of mitochondria",112,31871212,,,,-1.0952342,0.0000012,YES,,
TLLANCVAAGNVK,so,C,239,true,"S-sulfenylation site detection using YAP1C",110,32714340,,,,,,,,
MAESGCR,sno,C,466,true,"hot5-4 / wildtype, FAT-switch S-nitrosoproteome",169,37277371,,,,1.0439972,0.0002022,YES,,
ADSLLDKASKQSHTK,ub,K,495,true,"Arabidopsis ubiquitination by TUBEs",2,23667124,,,,,,,,
ADSLLDKASKQSHTK,ub,K,495,true,"Protein ubiquitination during photomorphogenesis",3,28461270,,,,,,,,
