Peptide,PTM,ModifiedAA,ModifiedPosition,PeptideUniqueToGene,ExperimentDesc,ExpID,PubmedID,ScoreType,IdentScore,LocProb,Log2FChange,PQ-val,QuantSig,PEP,MassErrorPPM
STSAPILNSWLPQHCSR,ph,S,7,true,"Tissue atlas Arabidopsis - ProteomicsDB",114,32188942,"MaxQuant score",222.6400000,0.9992470,,,,0,
ESSPEPESQLWR,ph,S,24,true,"Tissue atlas Arabidopsis - ProteomicsDB",114,32188942,"MaxQuant score",179.3500000,0.9998120,,,,1.2635199366384E-19,
RSTSLSLFSSK,ph,S,37,true,"atm and atr DNA damage response",88,25561503,"MASCOT Score",43.0000000,0.9920000,,,,,-1.0500000
STSLSLFSSK,ph,S,37,true,"STN8 phosphoproteome",38,21768351,"MASCOT Score",40.9800000,,,,,,-0.3757110
STSLSLFSSK,ph,S,37,true,"srk2dei ABA signaling phopshoproteomics",83,23572148,"MASCOT Score",44.0000000,,,,,,-0.0002000
STSLSLFSSK,ph,S,37,true,"atm and atr DNA damage response",88,25561503,"MASCOT Score",48.0000000,0.9880000,,,,,-1.0800000
STSLSLFSSK,ph,S,37,true,"TOR Kinase and ABA Receptor",100,29290610,XCorr,2.7750850,0.9841000,,,,0.00038290000520647,
STSLSLFSSK,ph,S,37,true,"Tissue atlas Arabidopsis - ProteomicsDB",114,32188942,"MaxQuant score",191.5700000,0.9999010,,,,2.163249975779E-18,
SIDGHTGEQLHQALSDNK,ph,S,45,true,"atm and atr DNA damage response",88,25561503,"MASCOT Score",35.0000000,0.9260000,,,,,-0.3300000
SIDGHTGEQLHQALSDNK,ph,S,45,true,"Tissue atlas Arabidopsis - ProteomicsDB",114,32188942,"MaxQuant score",174.8500000,1.0000000,,,,1.3834200346601E-28,
RSSLDETR,ph,S,88,true,"atm and atr DNA damage response",88,25561503,"MASCOT Score",21.0000000,0.9950000,,,,,-1.7100000
LFSSSGQGDK,ph,S,112,true,"atm and atr DNA damage response",88,25561503,"MASCOT Score",56.0000000,0.9920000,,,,,-0.7800000
LFSSSGQGDK,ph,S,112,true,"Tissue atlas Arabidopsis - ProteomicsDB",114,32188942,"MaxQuant score",155.3300000,0.9976380,,,,9.066170036931E-7,
