Peptide,PTM,ModifiedAA,ModifiedPosition,PeptideUniqueToGene,ExperimentDesc,ExpID,PubmedID,ScoreType,IdentScore,LocProb,Log2FChange,PQ-val,QuantSig,PEP,MassErrorPPM
QRVESHFDLELR,ph,S,702,false,"atm and atr DNA damage response",88,25561503,"MASCOT Score",33.0000000,1.0000000,,,,,-0.2400000
VESHFDLELR,ph,S,702,false,"Tissue atlas Arabidopsis - ProteomicsDB",114,32188942,"MaxQuant score",89.3110000,1.0000000,,,,0.00011472099868115,
VFENRVRQILMSSGSTTFTK,ph,S,1274,false,"srk2dei ABA signaling phopshoproteomics",83,23572148,"MASCOT Score",24.0000000,,,,,,0.0013000
VFENRVRQILMSSGSTTFTK,ph,T,1281,false,"srk2dei ABA signaling phopshoproteomics",83,23572148,"MASCOT Score",24.0000000,,,,,,0.0013000
DRHTLAYDK,ph,T,1453,false,"SIRK1 phosphorylation",86a,23820729,"MaxQuant Score",79.6880000,0.9990000,,,,0.39599999785423,4.5050000
KLTNAQR,me1,K,1541,false,"Arabidopsis protein methylome",123,31809900,"MaxQuant Score",147.0400000,1.0000000,,,,7.9721997485409E-33,-0.6009300
MNSSCADVLLFAAHK,so,C,1650,false,"Arabidopsis S-sulfenylation chemoproteomics",108,31578252,"pFind PSM Score",0.0754142,,,,,,-0.7332982
ALHVNNEKAK,ac,K,1973,false,"Quantitative Acetylproteomics",101,29440448,,,,,,,,
