Peptide,PTM,ModifiedAA,ModifiedPosition,PeptideUniqueToGene,ExperimentDesc,ExpID,PubmedID,ScoreType,IdentScore,LocProb,Log2FChange,PQ-val,QuantSig,PEP,MassErrorPPM
MAPDGVEDSDYESDPDELNR,ph,S,9,true,"TOR Kinase and ABA Receptor",100,29290610,XCorr,4.3915010,0.9060000,,,,4.9210000724997E-5,
APDGVEDSDYESDPDELNR,ph,S,9,true,"atm and atr DNA damage response",88,25561503,"MASCOT Score",36.0000000,0.9970000,,,,,1.7100000
MAPDGVEDSDYESDPDELNR,ph,S,13,true,"TOR Kinase and ABA Receptor",100,29290610,XCorr,4.3915010,0.9988000,,,,4.9210000724997E-5,
APDGVEDSDYESDPDELNR,ph,S,13,true,"atm and atr DNA damage response",88,25561503,"MASCOT Score",36.0000000,1.0000000,,,,,1.7100000
EASDDDEDDEEADDHDKLR,ph,S,30,true,"STN8 phosphoproteome",38,21768351,"MASCOT Score",80.5300000,,,,,,-1.7788900
EASDDDEDDEEADDHDKLR,ph,S,30,true,"Chloroplast kinase substrates",60,19376835,"MASCOT Score",64.4500000,,,,,,-1.7788900
EASDDDEDDEEADDHDKLR,ph,S,30,true,"LAXIC - mannitol vs control",84b,23660473,XCorr,3.2400000,1.0000000,-1.1196469,,NO,1.4100000043982E-5,
EASDDDEDDEEADDHDKLR,ph,S,30,true,"SnRK2 protein kinase substrates",85,23776212,XCorr,3.2931271,1.0000000,,,,0.011599600315094,
RREASDDDEDDEEADDHDK,ph,S,30,true,"TOR Kinase and ABA Receptor",100,29290610,XCorr,5.7997885,1.0000000,,,,1.1580000318645E-6,
KNVFASSLNSASPPFYPSR,ph,S,299,true,"Tissue atlas Arabidopsis - ProteomicsDB",114,32188942,"MaxQuant score",43.1640000,0.8739020,,,,0.0022670798934996,
KNVFASSLNSASPPFYPSR,ph,S,301,true,"Tissue atlas Arabidopsis - ProteomicsDB",114,32188942,"MaxQuant score",135.9800000,0.9850830,,,,5.2804299806034E-27,
NVFASSLNSASPPFYPSR,ph,S,301,true,"TOR Kinase and ABA Receptor",100,29290610,XCorr,3.7126608,0.8362000,,,,1.4029999874765E-5,
SNNNLAQK,ph,S,309,true,"atm and atr DNA damage response",88,25561503,"MASCOT Score",41.0000000,1.0000000,,,,,-0.9000000
SNNNLAQKDVQAGMGR,ub,K,316,true,"Arabidopsis ubiquitination COFRADIC",40,26744219,"MaxQuant Score",67.4150000,1.0000000,,,,9.3920000665548E-8,-0.1550000
VSSPMQIR,ph,S,380,true,"Tissue atlas Arabidopsis - ProteomicsDB",114,32188942,"MaxQuant score",126.0700000,0.9999930,,,,0.0029577100649476,
GTDQSCTQLPGQVFNQHSAVISLLPSSPPK,ph,S,416,true,"TOR Kinase and ABA Receptor",100,29290610,XCorr,3.5396504,0.8646000,,,,0.013410000130534,
RYSEMSFSK,ph,S,599,true,"Tissue atlas Arabidopsis - ProteomicsDB",114,32188942,"MaxQuant score",113.9500000,0.9991100,,,,0.00032611499773338,
