Peptide,PTM,ModifiedAA,ModifiedPosition,PeptideUniqueToGene,ExperimentDesc,ExpID,PubmedID,ScoreType,IdentScore,LocProb,Log2FChange,PQ-val,QuantSig,PEP,MassErrorPPM
GVNCVDYFTGGDKPYLITGSDDHTAK,ox,C,190,false,"SPEAR - 50 mM H2O2 / mock",138b,34619326,,,,5.5424093,0.0235211,YES,,
GVNCVDYFTGGDKPYLITGSDDHTAK,so,C,190,false,"Arabidopsis S-sulfenylation chemoproteomics",108,31578252,"pFind PSM Score",0.0287871,,0.9588100,,,,-1.6281861
ELGTCDLYPQSLK,sno,C,351,false,"hot5-4 / wildtype, FAT-switch S-nitrosoproteome",169,37277371,,,,,,,,
ELGTCDLYPQSLK,so,C,351,false,"Arabidopsis S-sulfenylation chemoproteomics",108,31578252,"pFind PSM Score",0.2537670,,,,,,0.1872153
ELGTCDLYPQSLK,so,C,351,false,"S-sulfenylation site detection using YAP1C",110,32714340,,,,,,,,
IFSKNFQEK,ac,K,416,false,"Quantitative Acetylproteomics",101,29440448,,,,,,,,
LDMAEECMR,so,C,689,true,"S-sulfenylation site detection using YAP1C",110,32714340,,,,,,,,
NDLTKISPK,ph,S,781,true,"Tissue atlas Arabidopsis - ProteomicsDB",114,32188942,"MaxQuant score",89.2310000,0.9998730,,,,0.0046501499600708,
LEQGDVLDEVGEEGEDGEEEEEEDRQEESSDGR,ph,S,878,true,"LAXIC - mannitol vs control",84b,23660473,XCorr,6.8600000,0.8650000,,,,3.5200000466501E-13,
LEQGDVLDEVGEEGEDGEEEEEEDRQEESSDGR,ph,S,878,true,"SnRK2 protein kinase substrates",85,23776212,XCorr,5.6441321,0.8830000,,,,6.0000900081736E-11,
