Peptide,PTM,ModifiedAA,ModifiedPosition,PeptideUniqueToGene,ExperimentDesc,ExpID,PubmedID,ScoreType,IdentScore,LocProb,Log2FChange,PQ-val,QuantSig,PEP,MassErrorPPM
KSLGSFSTR,ph,T,113,true,"Phosphoproteome ethylene-regulated time response",46,24043427,"MASCOT Score",29.9000000,,,,,,47.4614000
LVELSDDEETPVERR,ph,S,879,true,"TOR Kinase and ABA Receptor",100,29290610,XCorr,2.5599093,0.9999000,,,,0.020059999078512,
LVELSDDEETPVER,ph,S,879,true,"Tyrosine phosphorylation in Arabidopsis",59,18463617,"MASCOT Score",66.0000000,,,,,,-0.4679077
LVELSDDEETPVER,ph,S,879,true,"LAXIC - ABA stress",84a,23660473,XCorr,3.8600000,1.0000000,,,,0.0011186799965799,
LVELSDDEETPVER,ph,S,879,true,"LAXIC - mannitol vs control",84b,23660473,XCorr,3.9200000,1.0000000,,,,0.00041881398647092,
LVELSDDEETPVER,ph,S,879,true,"SnRK2 protein kinase substrates",85,23776212,XCorr,3.6016040,1.0000000,,,,0.0068042199127376,
LVELSDDEETPVER,ph,S,879,true,"atm and atr DNA damage response",88,25561503,"MASCOT Score",84.0000000,1.0000000,,,,,-0.5000000
LVELSDDEETPVER,ph,S,879,true,"TOR Kinase and ABA Receptor",100,29290610,XCorr,4.2139163,0.9999000,,,,3.6230001114745E-6,
LVELSDDEETPVER,ph,S,879,true,"Phospho cell culture sucrose/TOR",109,30833711,,,0.9999970,,,,,
LVELSDDEETPVER,ph,S,879,true,"Col-0 callus - FC Col-0 vs. Col-0 Xray",111a,31410901,,42.9600000,,0.9254726,0.0000000,NO,,0.5224962
LVELSDDEETPVER,ph,S,879,true,"Col-0 X-ray callus - FC Col-0 vs. Col-0 Xray",111b,31410901,,42.9600000,,0.9254726,0.0000000,NO,,0.5224962
LVELSDDEETPVER,ph,S,879,true,"atm callus - FC atm vs. atm Xray",111c,31410901,,42.9600000,,0.5219782,0.0000000,NO,,0.5224962
LVELSDDEETPVER,ph,S,879,true,"atm-3 X-ray callus - FC atm vs. atm Xray",111d,31410901,,42.9600000,,0.5219782,0.0000000,NO,,0.5224962
LVELSDDEETPVER,ph,S,879,true,"Tissue atlas Arabidopsis - ProteomicsDB",114,32188942,"MaxQuant score",252.4600000,1.0000000,,,,0,
