Peptide,PTM,ModifiedAA,ModifiedPosition,PeptideUniqueToGene,ExperimentDesc,ExpID,PubmedID,ScoreType,IdentScore,LocProb,Log2FChange,PQ-val,QuantSig,PEP,MassErrorPPM
MESIGVLMMCPMSSYLENELEKR,nta,M,1,true,"N-terminal ChaFRADIC",92,26010716,"MASCOT Score",48.8400000,,,,,1.5470000391815E-7,
MESIGVLMMCPM,nta,M,1,true,"Stromal N-terminome",96,26371235,"MASCOT Score",31.0500000,,,,,,
SSYLENELEKRF,nt,S,13,true,"Arabidopsis translation initiation landscape - NT",167b,35069635,,,,,,,,
SVLLETHRNSIR,ph,S,45,true,"atm and atr DNA damage response",88,25561503,"MASCOT Score",33.0000000,1.0000000,,,,,-0.2300000
SVLLETHRNSIR,ph,S,45,true,"Tissue atlas Arabidopsis - ProteomicsDB",114,32188942,"MaxQuant score",72.1750000,0.7697440,,,,0.0013873400166631,
IDLGKCK,so,C,86,true,"Arabidopsis S-sulfenylation chemoproteomics",108,31578252,"pFind PSM Score",0.2468410,,1.0101000,,,,0.7919198
FSGKSVGIIGLGR,ac,K,145,true,"Quantitative Acetylproteomics",101,29440448,,,,,,,,
DVAYKYYPTVV,nt,D,180,true,"Arabidopsis translation initiation landscape - NT",167b,35069635,,,,,,,,
