Peptide,PTM,ModifiedAA,ModifiedPosition,PeptideUniqueToGene,ExperimentDesc,ExpID,PubmedID,ScoreType,IdentScore,LocProb,Log2FChange,PQ-val,QuantSig,PEP,MassErrorPPM
TENPSQIEQKEEEAGSVK,ph,S,105,true,"Tissue atlas Arabidopsis - ProteomicsDB",114,32188942,"MaxQuant score",88.4180000,0.9999960,,,,1.7921300241142E-5,
LEMTASQDSQPEQPK,ph,S,186,true,"Tissue atlas Arabidopsis - ProteomicsDB",114,32188942,"MaxQuant score",201.6600000,0.9998960,,,,7.0064923216241E-45,
LEMTASQDSQPEQPK,ph,S,189,true,"Tissue atlas Arabidopsis - ProteomicsDB",114,32188942,"MaxQuant score",114.5400000,0.9902940,,,,4.6077498154773E-6,
LEMTASQDSQPEQPKSEAEESQPEDSEAK,ph,S,196,true,"TOR Kinase and ABA Receptor",100,29290610,XCorr,5.0595779,0.9971000,,,,0.00012280000373721,
LEMTASQDSQPEQPKSEAEESQPEDSEAK,ph,S,196,true,"Phospho cell culture sucrose/TOR",109,30833711,,,0.9641930,,,,,
LEMTASQDSQPEQPKSEAEESQPEDSEAK,ph,S,196,true,"Tissue atlas Arabidopsis - ProteomicsDB",114,32188942,"MaxQuant score",160.6300000,0.9983230,,,,0,
SEAEESQPEDSEAK,ph,S,201,true,"atm and atr DNA damage response",88,25561503,"MASCOT Score",32.0000000,1.0000000,,,,,-1.4700000
SEAEESQPEDSEAK,ph,S,201,true,"Tissue atlas Arabidopsis - ProteomicsDB",114,32188942,"MaxQuant score",165.3600000,0.9999890,,,,1.3915799935982E-11,
DTVHSPVLDGQHK,ph,S,221,true,"Pollen phosphoproteome Arabidopsis",43,22631563,"MASCOT Score",43.4600000,,,,,,-0.3346630
DTVHSPVLDGQHK,ph,S,221,true,"Tyrosine phosphorylation in Arabidopsis",59,18463617,"MASCOT Score",27.0000000,,,,,,0.0000000
DTVHSPVLDGQHK,ph,S,221,true,"atm and atr DNA damage response",88,25561503,"MASCOT Score",57.0000000,1.0000000,,,,,-0.4200000
DTVHSPVLDGQHK,ph,S,221,true,"TOR Kinase and ABA Receptor",100,29290610,XCorr,3.7316492,1.0000000,,,,8.1719997979235E-5,
DTVHSPVLDGQHK,ph,S,221,true,"Lateral root-induction - NAA vs control",106,23328941,"MASCOT Score",36.0000000,,0.3601210,0.1600067,NO,,
DTVHSPVLDGQHK,ph,S,221,true,"Phospho cell culture sucrose/TOR",109,30833711,,,0.9999930,,,,,
DTVHSPVLDGQHK,ph,S,221,true,"Col-0 callus - FC Col-0 vs. Col-0 Xray",111a,31410901,,42.3000000,,-0.3449458,0.0000000,NO,,0.6479018
DTVHSPVLDGQHK,ph,S,221,true,"Col-0 X-ray callus - FC Col-0 vs. Col-0 Xray",111b,31410901,,42.3000000,,-0.3449458,0.0000000,NO,,0.6479018
DTVHSPVLDGQHK,ph,S,221,true,"atm callus - FC atm vs. atm Xray",111c,31410901,,42.3000000,,4.9346241,0.0000000,NO,,0.6479018
DTVHSPVLDGQHK,ph,S,221,true,"atm-3 X-ray callus - FC atm vs. atm Xray",111d,31410901,,42.3000000,,4.9346241,0.0000000,NO,,0.6479018
DTVHSPVLDGQHK,ph,S,221,true,"Tissue atlas Arabidopsis - ProteomicsDB",114,32188942,"MaxQuant score",198.3100000,1.0000000,,,,9.0007000589355E-31,
TSSKNFEVSPDINHVNR,ph,S,253,true,"Tissue atlas Arabidopsis - ProteomicsDB",114,32188942,"MaxQuant score",139.1600000,0.8915140,,,,5.4260301113329E-11,
NFEVSPDINHVNRIESPVAHPSLIFESDGSPYESSIPK,ph,S,259,true,"TOR Kinase and ABA Receptor",100,29290610,XCorr,4.1347766,0.8895000,,,,0.0077379997819662,
NFEVSPDINHVNR,ph,S,259,true,"atm and atr DNA damage response",88,25561503,"MASCOT Score",46.0000000,1.0000000,,,,,-0.2600000
NFEVSPDINHVNR,ph,S,259,true,"Tissue atlas Arabidopsis - ProteomicsDB",114,32188942,"MaxQuant score",296.8500000,1.0000000,,,,0,
IESPVAHPSLIFESDGSPYESSIPK,ph,S,270,true,"SnRK2 protein kinase substrates",85,23776212,XCorr,2.3880386,0.8870000,,,,0.017047200351954,
IESPVAHPSLIFESDGSPYESSIPK,ph,S,270,true,"TOR Kinase and ABA Receptor",100,29290610,XCorr,5.5908718,0.9999000,,,,2.8080000902264E-6,
IESPVAHPSLIFESDGSPYESSIPK,ph,S,270,true,"Lateral root-induction - NAA vs control",106,23328941,"MASCOT Score",21.0000000,,,,,,
IESPVAHPSLIFESDGSPYESSIPK,ph,S,270,true,"Col-0 callus - FC Col-0 vs. Col-0 Xray",111a,31410901,,47.5500000,,0.2502157,0.0000000,NO,,0.9352862
IESPVAHPSLIFESDGSPYESSIPK,ph,S,270,true,"Col-0 X-ray callus - FC Col-0 vs. Col-0 Xray",111b,31410901,,47.5500000,,0.2502157,0.0000000,NO,,0.9352862
IESPVAHPSLIFESDGSPYESSIPK,ph,S,270,true,"atm callus - FC atm vs. atm Xray",111c,31410901,,47.5500000,,0.8398213,0.0000000,NO,,0.9352862
IESPVAHPSLIFESDGSPYESSIPK,ph,S,270,true,"atm-3 X-ray callus - FC atm vs. atm Xray",111d,31410901,,47.5500000,,0.8398213,0.0000000,NO,,0.9352862
IESPVAHPSLIFESDGSPYESSIPK,ph,S,270,true,"Tissue atlas Arabidopsis - ProteomicsDB",114,32188942,"MaxQuant score",228.5500000,0.9999880,,,,0,
IESPVAHPSLIFESDGSPYESSIPK,ph,S,284,true,"Tissue atlas Arabidopsis - ProteomicsDB",114,32188942,"MaxQuant score",63.2030000,0.7934050,,,,1.7142100432466E-6,
RSSSDEISER,ph,S,294,true,"Tissue atlas Arabidopsis - ProteomicsDB",114,32188942,"MaxQuant score",75.0200000,0.9784780,,,,0.0086063696071506,
RSSSDEISER,ph,S,295,true,"LAXIC - mannitol vs control",84b,23660473,XCorr,2.8700000,0.9860000,,,,1.3000000365082E-7,
RSSSDEISER,ph,S,295,true,"SnRK2 protein kinase substrates",85,23776212,XCorr,3.8559999,0.9970000,,,,0.0025905999355018,
RSSSDEISER,ph,S,295,true,"atm and atr DNA damage response",88,25561503,"MASCOT Score",50.0000000,0.9040000,,,,,0.2100000
RSSSDEISER,ph,S,295,true,"Phospho cell culture sucrose/TOR",109,30833711,,,0.8904610,,,,,
RSSSDEISER,ph,S,295,true,"Col-0 callus - FC Col-0 vs. Col-0 Xray",111a,31410901,,56.3000000,,-2.1321326,0.0000000,NO,,0.1663230
RSSSDEISER,ph,S,295,true,"Col-0 X-ray callus - FC Col-0 vs. Col-0 Xray",111b,31410901,,56.3000000,,-2.1321326,0.0000000,NO,,0.1663230
RSSSDEISER,ph,S,295,true,"atm callus - FC atm vs. atm Xray",111c,31410901,,56.3000000,,2.5999426,0.0000000,NO,,0.1663230
RSSSDEISER,ph,S,295,true,"atm-3 X-ray callus - FC atm vs. atm Xray",111d,31410901,,56.3000000,,2.5999426,0.0000000,NO,,0.1663230
RSSSDEISER,ph,S,295,true,"Tissue atlas Arabidopsis - ProteomicsDB",114,32188942,"MaxQuant score",110.5500000,0.9855620,,,,0.00016373400285374,
RSSSDEISER,ph,S,296,true,"Large-scale phosphorylation discovery",44,23111157,XCorr,4.2060000,,,,,,
RSSSDEISER,ph,S,296,true,"atm and atr DNA damage response",88,25561503,"MASCOT Score",58.0000000,0.9940000,,,,,0.1400000
RSSSDEISER,ph,S,296,true,"TOR Kinase and ABA Receptor",100,29290610,XCorr,3.0296998,0.9928000,,,,3.9719998312648E-5,
SSSDEISER,ph,S,296,true,"STN8 phosphoproteome",38,21768351,"MASCOT Score",37.9000000,,,,,,0.5178000
SSSDEISER,ph,S,296,true,"LAXIC - mannitol vs control",84b,23660473,XCorr,2.5400000,0.9960000,,,,0.006351709831506,
SSSDEISER,ph,S,296,true,"SnRK2 protein kinase substrates",85,23776212,XCorr,2.8805046,0.9990000,,,,0.00011333399743307,
SSSDEISER,ph,S,296,true,"atm and atr DNA damage response",88,25561503,"MASCOT Score",47.0000000,0.9970000,,,,,0.2600000
SSSDEISER,ph,S,296,true,"Lateral root-induction - NAA vs control",106,23328941,"MASCOT Score",30.0000000,,,,,,
SSSDEISER,ph,S,296,true,"Phospho cell culture sucrose/TOR",109,30833711,,,0.9321510,,,,,
SSSDEISER,ph,S,296,true,"Tissue atlas Arabidopsis - ProteomicsDB",114,32188942,"MaxQuant score",143.7600000,0.9999930,,,,4.7716798690089E-7,
LDTSELNESQR,ph,S,323,true,"Tissue atlas Arabidopsis - ProteomicsDB",114,32188942,"MaxQuant score",143.2500000,1.0000000,,,,4.8068198310602E-8,
SSSATNVSDSADVILELEK,ph,S,326,true,"Large-scale phosphorylation discovery",44,23111157,XCorr,5.4780000,,,,,,
SSSATNVSDSADVILELEK,ph,S,328,true,"Large-scale phosphorylation discovery",44,23111157,XCorr,4.8200000,,,,,,
SSSATNVSDSADVILELEK,ph,S,328,true,"SnRK2 protein kinase substrates",85,23776212,XCorr,2.9288743,0.8770000,,,,0.0025493500288576,
SSSATNVSDSADVILELEK,ph,T,330,true,"Large-scale phosphorylation discovery",44,23111157,XCorr,3.8820000,,,,,,
SSSATNVSDSADVILELEK,ph,S,333,true,"Large-scale phosphorylation discovery",44,23111157,XCorr,4.9200000,,,,,,
KSNEAEVESLR,ub,K,390,true,"Arabidopsis ubiquitination COFRADIC",40,26744219,"MaxQuant Score",56.2050000,1.0000000,,,,0.0010000000474975,0.3350000
LQEAESKAATAEER,ub,K,658,true,"Arabidopsis ubiquitination COFRADIC",40,26744219,"MaxQuant Score",125.6700000,1.0000000,,,,2.0710000228121E-17,-0.5350000
INVLEAQLSCLR,so,C,689,true,"S-sulfenylation site detection using YAP1C",110,32714340,,,,,,,,
AEQGQLSKSLEKER,ub,K,699,true,"Arabidopsis ubiquitination COFRADIC",40,26744219,"MaxQuant Score",55.7550000,0.9990000,,,,0.00018980000459123,0.3500000
AEQGQLSKSLEKER,ub,K,703,true,"Arabidopsis ubiquitination COFRADIC",40,26744219,"MaxQuant Score",81.6560000,0.9980000,,,,7.3249997512903E-5,2.1020000
QEYLAAKEEADTLEGR,ub,K,719,true,"Arabidopsis ubiquitination COFRADIC",40,26744219,"MaxQuant Score",174.8700000,1.0000000,,,,0,-0.0330000
INSSAVSEQLPIAR,ph,S,779,true,"Tissue atlas Arabidopsis - ProteomicsDB",114,32188942,"MaxQuant score",205.1200000,0.9858080,,,,4.3482291347999E-42,
INSSAVSEQLPIAR,ph,S,780,true,"Tissue atlas Arabidopsis - ProteomicsDB",114,32188942,"MaxQuant score",136.8100000,0.9430760,,,,1.7591699361219E-5,
INSSAVSEQLPIAR,ph,S,783,true,"Tissue atlas Arabidopsis - ProteomicsDB",114,32188942,"MaxQuant score",165.5800000,0.9999910,,,,1.7749599533212E-12,
QNSAFENGSLPR,ph,S,793,true,"STN8 phosphoproteome",38,21768351,"MASCOT Score",63.8100000,,,,,,-0.8277710
QNSAFENGSLPR,ph,S,793,true,"Pollen phosphoproteome Arabidopsis",43,22631563,"MASCOT Score",54.8600000,,,,,,
QNSAFENGSLPR,ph,S,793,true,"Large-scale phosphorylation discovery",44,23111157,XCorr,2.9920000,,,,,,
QNSAFENGSLPR,ph,S,793,true,"Tyrosine phosphorylation in Arabidopsis",59,18463617,"MASCOT Score",52.0000000,,,,,,-0.2145013
QNSAFENGSLPR,ph,S,793,true,"Chloroplast kinase substrates",60,19376835,"MASCOT Score",48.8500000,,,,,,-0.9848460
QNSAFENGSLPR,ph,S,793,true,"srk2dei ABA signaling phopshoproteomics",83,23572148,"MASCOT Score",63.0000000,,,,,,-0.0002000
QNSAFENGSLPR,ph,S,793,true,"LAXIC - ABA stress",84a,23660473,XCorr,3.2800000,1.0000000,,,,3.9699998524156E-6,
QNSAFENGSLPR,ph,S,793,true,"LAXIC - mannitol vs control",84b,23660473,XCorr,2.8800000,1.0000000,,,,0.00055210699792951,
QNSAFENGSLPR,ph,S,793,true,"SnRK2 protein kinase substrates",85,23776212,XCorr,2.7522562,1.0000000,,,,0.00053535599727184,
QNSAFENGSLPR,ph,S,793,true,"atm and atr DNA damage response",88,25561503,"MASCOT Score",71.0000000,1.0000000,,,,,-0.0900000
QNSAFENGSLPR,ph,S,793,true,"TOR Kinase and ABA Receptor",100,29290610,XCorr,3.6839590,1.0000000,,,,3.161000131513E-5,
QNSAFENGSLPR,ph,S,793,true,"Lateral root-induction - NAA vs control",106,23328941,"MASCOT Score",35.0000000,,0.3153037,0.2227026,NO,,
QNSAFENGSLPR,ph,S,793,true,"Tissue atlas Arabidopsis - ProteomicsDB",114,32188942,"MaxQuant score",207.8000000,1.0000000,,,,5.8461199091818E-31,
QNSAFENGSLPR,ph,S,799,true,"atm and atr DNA damage response",88,25561503,"MASCOT Score",71.0000000,1.0000000,,,,,-0.0900000
SMPEATMSPYYMK,ph,S,841,true,"Tissue atlas Arabidopsis - ProteomicsDB",114,32188942,"MaxQuant score",153.3900000,0.9992050,,,,1.0996100030525E-7,
SITPSAYEATLR,ph,T,849,true,"Tissue atlas Arabidopsis - ProteomicsDB",114,32188942,"MaxQuant score",162.3100000,0.9999340,,,,1.0712599696205E-9,
QKEGELASYMTR,ub,K,860,true,"Arabidopsis ubiquitination COFRADIC",40,26744219,"MaxQuant Score",46.3780000,1.0000000,,,,0.003000000026077,-0.4670000
LASMESIRDSLAEELVK,ph,S,873,true,"TOR Kinase and ABA Receptor",100,29290610,XCorr,3.5399618,0.9973000,,,,0.0012959999730811,
LASMESIR,ph,S,873,true,"atm and atr DNA damage response",88,25561503,"MASCOT Score",28.0000000,0.9940000,,,,,-0.4000000
LASMESIR,ph,S,873,true,"Phospho cell culture sucrose/TOR",109,30833711,,,0.9997410,,,,,
ADIVDLKEMYR,ub,K,941,true,"Arabidopsis ubiquitination COFRADIC",40,26744219,"MaxQuant Score",67.3850000,1.0000000,,,,0.0020000000949949,0.1390000
