Peptide,PTM,ModifiedAA,ModifiedPosition,PeptideUniqueToGene,ExperimentDesc,ExpID,PubmedID,ScoreType,IdentScore,LocProb,Log2FChange,PQ-val,QuantSig,PEP,MassErrorPPM
SHLPHSKKIETEEER,nt,S,122,true,"Arabidopsis translation initiation landscape - NT",167b,35069635,,,,,,,,
KPTTFICK,so,C,196,true,"Arabidopsis S-sulfenylation chemoproteomics",108,31578252,"pFind PSM Score",0.0128422,,2.0408200,,,,0.4824257
APLAPEDEELLRDDDAVTPIKK,ph,T,281,true,"TOR Kinase and ABA Receptor",100,29290610,XCorr,3.1028564,1.0000000,,,,0.00022190000163391,
APLAPEDEELLRDDDAVTPIK,ph,T,281,true,"TOR Kinase and ABA Receptor",100,29290610,XCorr,3.1257975,1.0000000,,,,0.011819999665022,
DDDAVTPIKK,ph,T,281,true,"Tissue atlas Arabidopsis - ProteomicsDB",114,32188942,"MaxQuant score",221.8000000,1.0000000,,,,0,
SRAILKSYVVAGSDTANPE,nt,S,418,true,"Arabidopsis translation initiation landscape - NT",167b,35069635,,,,,,,,
STVSVIEHKDSGVYSSR,ph,S,541,true,"Tissue atlas Arabidopsis - ProteomicsDB",114,32188942,"MaxQuant score",52.4510000,0.8205350,,,,0.00076622498454526,
VGASSSKMR,ub,K,554,true,"Arabidopsis ubiquitination COFRADIC",40,26744219,"MaxQuant Score",47.1870000,1.0000000,,,,0.023000000044703,-0.1570000
HEPEQDANQYSDGNEDDYSE,ph,Y,579,true,"srk2dei ABA signaling phopshoproteomics",83,23572148,"MASCOT Score",43.0000000,,,,,,-0.0056000
SWKHEPEQDANQYSDGNEDDYSE,ph,S,580,true,"SnRK2 protein kinase substrates",85,23776212,XCorr,3.6297686,0.7870000,,,,0.0041244998574257,
HEPEQDANQYSDGNEDDYSE,ph,S,580,true,"atm and atr DNA damage response",88,25561503,"MASCOT Score",67.0000000,1.0000000,,,,,-0.3700000
HEPEQDANQYSDGNEDDYSE,ph,S,580,true,"TOR Kinase and ABA Receptor",100,29290610,XCorr,6.6787806,0.8990000,,,,1.0889999657593E-7,
HEPEQDANQYSDGNEDDYSE,ph,S,588,true,"srk2dei ABA signaling phopshoproteomics",83,23572148,"MASCOT Score",43.0000000,,,,,,-0.0056000
HEPEQDANQYSDGNEDDYSE,ph,S,588,true,"atm and atr DNA damage response",88,25561503,"MASCOT Score",67.0000000,0.9980000,,,,,-0.3700000
HEPEQDANQYSDGNEDDYSE,ph,S,588,true,"TOR Kinase and ABA Receptor",100,29290610,XCorr,6.6787806,0.8990000,,,,1.0889999657593E-7,
