Peptide,PTM,ModifiedAA,ModifiedPosition,PeptideUniqueToGene,ExperimentDesc,ExpID,PubmedID,ScoreType,IdentScore,LocProb,Log2FChange,PQ-val,QuantSig,PEP,MassErrorPPM
ATKRSVGTLKEADLKGKSVF,nta,A,2,true,"Arabidopsis translation initiation landscape - NTA",167a,35069635,,,,,,,,
TLKEADLKGKSVFVR,nt,T,9,true,"Metacaspase9 substrates - Col-0 / mc9",51a,23964026,"MASCOT Score",64.0000000,,1.2098115,,NO,,-2.4166706
SVGTLKEADLK,ub,K,11,true,"upl3 mutant / wildtype",168,35926874,"MaxQuant score",52.2470000,1.0000000,,,,0.0036074200179428,0.5509900
EADLKGKSVFVR,nt,E,12,true,"Metacaspase9 substrates - Col-0 / mc9",51a,23964026,"MASCOT Score",49.0000000,,1.3320011,,NO,,-1.7835307
EADLKGK,ac,K,16,true,"Quantitative Acetylproteomics",101,29440448,,,,,,,,
GKSVFVR,ac,K,18,true,"Quantitative Acetylproteomics",101,29440448,,,,,,,,
VDLNVPLDDNSNITDDTR,nt,V,24,true,"Arg/N-end rule pathway Roots",80,25728785,"MASCOT Score",57.7400000,,,,,8.6289997369704E-9,
AAVPTIKYLMGNGSR,nt,A,44,true,"Arabidopsis translation initiation landscape - NT",167b,35069635,,,,,,,,
CSHLGRPKGVTPKY,nt,C,62,true,"Arabidopsis translation initiation landscape - NT",167b,35069635,,,,,,,,
VVLCSHLGRPK,so,C,62,true,"S-sulfenylation site detection using YAP1C",110,32714340,,,,,,,,
VVLCSHLGR,so,C,62,true,"Arabidopsis S-sulfenylation chemoproteomics",108,31578252,"pFind PSM Score",0.0040702,,0.7526900,,,,0.6563910
SHLGRPKGVTPKY,nt,S,63,true,"Arabidopsis translation initiation landscape - NT",167b,35069635,,,,,,,,
GVTPKYSLKPLVPR,ac,K,74,true,"Histone deacetylases- hda14 vs WT (low light)",98c,29061669,"MaxQuant Score",135.8100000,1.0000000,-1.9670000,0.9885531,NO,8.6000000010245E-7,
GVTPKYSLK,ac,K,74,true,"Histone deacetylases - apicidin vs control",98a,29061669,"MaxQuant Score",95.3000000,1.0000000,-0.0980000,0.6729767,NO,2.4000000209412E-8,
GVTPKYSLK,ac,K,74,true,"Histone deacetylases substrates - TSA vs control",98b,29061669,"MaxQuant Score",95.3000000,1.0000000,0.5310000,0.9977001,NO,2.4000000209412E-8,
PKGVTPKYSLKPLVPR,ub,K,74,true,"Arabidopsis ubiquitination COFRADIC",40,26744219,"MaxQuant Score",52.1720000,0.8390000,,,,7.3099996370729E-5,0.9180000
GVTPKYSLKPLVPR,ub,K,74,true,"upl3 mutant / wildtype",168,35926874,"MaxQuant score",79.0890000,0.9990000,1.1269729,,,9.6305600891355E-5,-0.3757600
FYAEEEKNDPEFAKK,ac,K,129,true,"Quantitative Acetylproteomics",101,29440448,,,,,,,,
FYAEEEKNDPEFAK,ac,K,129,true,"Histone deacetylases - apicidin vs control",98a,29061669,"MaxQuant Score",70.9000000,1.0000000,0.1690000,0.5105050,NO,3.7999998312443E-5,
FYAEEEKNDPEFAK,ac,K,129,true,"Histone deacetylases substrates - hda14 vs WT",98e,29061669,"MaxQuant Score",72.9000000,1.0000000,0.1770000,0.8016781,NO,3.5999998999614E-6,
FYAEEEKNDPEFAK,ac,K,129,true,"Quantitative Acetylproteomics",101,29440448,,,,,,,,
EEEKNDPEFAKK,ac,K,129,false,"Quantitative Acetylproteomics",101,29440448,,,,,,,,
EEEKNDPEFAK,ac,K,129,false,"Histone deacetylases - apicidin vs control",98a,29061669,"MaxQuant Score",163.7000000,1.0000000,-0.4400000,0.2123244,NO,2.8000000869193E-17,
EEEKNDPEFAK,ac,K,129,false,"Histone deacetylases substrates - TSA vs control",98b,29061669,"MaxQuant Score",163.7000000,1.0000000,-0.0290000,0.9977001,NO,2.8000000869193E-17,
EEEKNDPEFAK,ac,K,129,false,"Histone deacetylases- hda14 vs WT (low light)",98c,29061669,"MaxQuant Score",174.0500000,1.0000000,-0.4840000,0.9885531,NO,2.5000000333786E-11,
EEEKNDPEFAK,ac,K,129,false,"Histone deacetylases substrates - hda14 vs WT",98e,29061669,"MaxQuant Score",90.3000000,1.0000000,0.1530000,0.8531001,NO,2.3000000126672E-8,
EEEKNDPEFAK,ac,K,129,false,"Quantitative Acetylproteomics",101,29440448,,,,,,,,
FYAEEEKNDPEFAK,ub,K,129,true,"upl3 mutant / wildtype",168,35926874,"MaxQuant score",50.0880000,1.0000000,0.1852323,,,0.0027259800117463,0.6446900
FYAEEEKNDPEFAKK,ac,K,136,true,"Quantitative Acetylproteomics",101,29440448,,,,,,,,
EEEKNDPEFAKK,ac,K,136,false,"Quantitative Acetylproteomics",101,29440448,,,,,,,,
NDPEFAKK,ac,K,136,false,"Histone deacetylases - apicidin vs control",98a,29061669,"MaxQuant Score",120.3000000,1.0000000,0.0400000,0.8090959,NO,0.0060000000521541,
FYAEEEKNDPEFAKK,cr,K,136,true,"Open search Plant PTM Viewer 2.0 - Crotonylation",164c,TBA,,,,,,,,
KLAALADVYVNDAFGTAHR,ub,K,137,true,"upl3 mutant / wildtype",168,35926874,"MaxQuant score",107.7200000,1.0000000,0.0285692,,,1.103889965548E-10,-0.4409800
VAKFLKPSVAGFLMQKE,nta,V,163,true,"Arabidopsis translation initiation landscape - NTA",167a,35069635,,,,,,,,
ELDYLVGAVANPKKPFAAIVGGSK,ub,K,191,true,"upl3 mutant / wildtype",168,35926874,"MaxQuant score",80.8350000,0.7550000,-0.1648844,0.8896600,NO,4.1326000399522E-8,-0.2691300
KPFAAIVGGSK,ph,S,201,true,"atm and atr DNA damage response",88,25561503,"MASCOT Score",46.0000000,1.0000000,,,,,-1.5500000
KPFAAIVGGSK,ph,S,201,true,"Phospho cell culture sucrose/TOR",109,30833711,,,1.0000000,,,,,
KPFAAIVGGSK,ph,S,201,true,"Tissue atlas Arabidopsis - ProteomicsDB",114,32188942,"MaxQuant score",69.8780000,1.0000000,,,,0.0026253599207848,
GLSVGSSLVEE,nt,G,235,false,"Arg/N-end rule seed, prt6 vs. Wt",99,29168982,"MASCOT Score",62.9400000,,-0.1456803,0.5727809,NO,0.00013430000399239,-0.8220795
GLSVGSSLVE,nt,G,235,false,"Arg/N-end rule seed, prt6 vs. Wt",99,29168982,"MASCOT Score",62.7500000,,-0.5641756,0.1542907,NO,0.00037930000689812,-1.2256211
SLMEKAK,ac,K,257,true,"Quantitative Acetylproteomics",101,29440448,,,,,,,,
FAAGTEAVAKQLAELSGK,ub,K,341,true,"upl3 mutant / wildtype",168,35926874,"MaxQuant score",48.9070000,1.0000000,-0.7273795,,,0.0013307300396264,0.2820100
GKPLPGVLALDEA,nt,G,389,true,"Arabidopsis translation initiation landscape - NT",167b,35069635,,,,,,,,
