Peptide,PTM,ModifiedAA,ModifiedPosition,PeptideUniqueToGene,ExperimentDesc,ExpID,PubmedID,ScoreType,IdentScore,LocProb,Log2FChange,PQ-val,QuantSig,PEP,MassErrorPPM
TKKAVLIGINYPGTKAELR,nt,T,2,true,"Arg/N-end rule pathway Roots",80,25728785,"MASCOT Score",29.1800000,,,,,0.00037339999107644,
TKKAVLIGINYPGTKAE,nt,T,2,true,"Arabidopsis translation initiation landscape - NT",167b,35069635,,,,,,,,
TKKAVLIGIN,nt,T,2,true,"N-term acetylation drought responses",5,26184543,,,,,,,,
DMNLITDDDFR,nt,D,110,false,"Arg/N-end rule seed, prt6 vs. Wt",99,29168982,"MASCOT Score",42.5700000,,-0.9602037,0.0540981,NO,0.022390000522137,-2.8464568
LITDDDFR,nt,L,113,false,"Arg/N-end rule seed, prt6 vs. Wt",99,29168982,"MASCOT Score",29.6900000,,-1.1043614,0.1558798,NO,0.19859999418259,1.6263488
SCHSGGLIDE,nt,S,138,false,"Arg/N-end rule seed, prt6 vs. Wt",99,29168982,"MASCOT Score",40.7700000,,-0.0810294,0.2142532,NO,0.0085909999907017,-1.5838000
MTIISDSCHSGGLIDEAK,acy,C,139,true,"Arabidopsis S-acylation atlas - Leaf",163c,35681017,,,,,,,,
MTIISDSCHSGGLIDEAK,sno,C,139,true,"Site-specific nitrosomeproteomic id - gsnor1-3",90a,25699590,XCorr,3.2600000,,,,,0.10329999774694,-7.1700000
MTIISDSCHSGGLIDEAK,sno,C,139,true,"Site-specific nitrosomeproteomic id - gsnor1-3",90b,25699590,XCorr,3.4800000,,,,,6.1170001572464E-5,-7.3800000
MTIISDSCHSGGLIDEAK,so,C,139,true,"Arabidopsis S-sulfenylation chemoproteomics",108,31578252,"pFind PSM Score",0.0127926,,,,,,-2.0949854
EAEDEDESEESSSR,ph,S,166,true,"atm and atr DNA damage response",88,25561503,"MASCOT Score",53.0000000,0.9950000,,,,,-0.1000000
EAEDEDESEESSSR,ph,S,166,true,"Lateral root-induction - NAA vs control",106,23328941,"MASCOT Score",29.0000000,,,,,,
KEAEDEDESEESSSR,ph,S,170,true,"Tissue atlas Arabidopsis - ProteomicsDB",114,32188942,"MaxQuant score",127.3700000,0.7987600,,,,2.302389958686E-7,
SKVEGAIESR,nt,S,181,true,"Arg/N-end rule seed, prt6 vs. Wt",99,29168982,"MASCOT Score",34.6000000,,-0.6569833,0.0276525,NO,0.017769999802113,0.4075692
SKVEGAIESR,ph,S,181,true,"Tissue atlas Arabidopsis - ProteomicsDB",114,32188942,"MaxQuant score",98.3370000,1.0000000,,,,0.00089038402074948,
SKVEGAIESR,ac,K,182,true,"Quantitative Acetylproteomics",101,29440448,,,,,,,,
SKVEGAIESR,ub,K,182,true,"Arabidopsis ubiquitination COFRADIC",40,26744219,"MaxQuant Score",61.3440000,1.0000000,,,,0.0089999996125698,-1.8620000
VEGAIESR,ph,S,189,true,"Tissue atlas Arabidopsis - ProteomicsDB",114,32188942,"MaxQuant score",136.3300000,1.0000000,,,,2.7004900402972E-5,
GFHIGGNKKDEDEAEEIETK,nt,G,191,true,"Metacaspase9 substrates - Col-0 / mc9",51a,23964026,"MASCOT Score",99.0000000,,1.1084794,,NO,,-2.5344289
EIELEDGETIHAKDK,nt,E,211,true,"Arabidopsis translation initiation landscape - NT",167b,35069635,,,,,,,,
IELEDGETIHAKDK,nt,I,212,true,"Arabidopsis translation initiation landscape - NT",167b,35069635,,,,,,,,
LEDGETIHAKDK,nt,L,214,true,"Arabidopsis translation initiation landscape - NT",167b,35069635,,,,,,,,
EDGETIHAKDK,nt,E,215,true,"Arabidopsis translation initiation landscape - NT",167b,35069635,,,,,,,,
SLPLQTLIDILKQQTGNDNIE,nt,S,226,true,"N-terminal ChaFRADIC",92,26010716,"MASCOT Score",50.3100000,,,,,3.3900000584453E-9,
LASGFLEGK,ph,S,296,true,"Ethylene-regulated phosphorylation ein2 mutant",30,19253305,"MASCOT Score",37.2549000,,,,,,-4.4535046
LASGFLEGK,ph,S,296,true,"STN8 phosphoproteome",38,21768351,"MASCOT Score",48.6000000,,,,,,0.2160820
LASGFLEGK,ph,S,296,true,"Phosphoproteome iron-deficient Arabidopsis roots",41,22438062,"MASCOT Score",35.2500000,,,,,,
LASGFLEGK,ph,S,296,true,"Pollen phosphoproteome Arabidopsis",43,22631563,"MASCOT Score",61.4800000,,,,,,0.3158350
LASGFLEGK,ph,S,296,true,"Chloroplast kinase substrates",60,19376835,"MASCOT Score",39.4600000,,,,,,-1.7191200
LASGFLEGK,ph,S,296,true,"srk2dei ABA signaling phopshoproteomics",83,23572148,"MASCOT Score",65.0000000,,,,,,0.0010000
LASGFLEGK,ph,S,296,true,"LAXIC - mannitol vs control",84b,23660473,XCorr,2.7800000,1.0000000,SINGLETON_UP,0.0000000,YES,2.8800000109186E-6,
LASGFLEGK,ph,S,296,true,"SnRK2 protein kinase substrates",85,23776212,XCorr,2.1537304,1.0000000,,,,0.0057521001435816,
LASGFLEGK,ph,S,296,true,"atm and atr DNA damage response",88,25561503,"MASCOT Score",54.0000000,1.0000000,,,,,-1.5400000
LASGFLEGK,ph,S,296,true,"TOR Kinase and ABA Receptor",100,29290610,XCorr,3.2172253,1.0000000,,,,0.00029359999462031,
LASGFLEGK,ph,S,296,true,"Lateral root-induction - NAA vs control",106,23328941,"MASCOT Score",21.0000000,,,,,,
LASGFLEGK,ph,S,296,true,"Tissue atlas Arabidopsis - ProteomicsDB",114,32188942,"MaxQuant score",138.2500000,1.0000000,,,,9.2852002126165E-5,
GSVPLPDSGIL,nt,G,330,true,"N-terminal ChaFRADIC",92,26010716,"MASCOT Score",23.0800000,,,,,0.0094579998403788,
QTDQTSADATPAGKPTE,nt,Q,345,true,"Arg/N-end rule seed, prt6 vs. Wt",99,29168982,"MASCOT Score",36.6300000,,-0.5860553,0.0030076,NO,1.9510000559553E-10,-3.3739375
