Peptide,PTM,ModifiedAA,ModifiedPosition,PeptideUniqueToGene,ExperimentDesc,ExpID,PubmedID,ScoreType,IdentScore,LocProb,Log2FChange,PQ-val,QuantSig,PEP,MassErrorPPM
PLFMPDEELARL,nt,P,2,true,"Arabidopsis translation initiation landscape - NT",167b,35069635,,,,,,,,
LSSDAASVVAER,ph,S,15,true,"Tissue atlas Arabidopsis - ProteomicsDB",114,32188942,"MaxQuant score",96.3710000,0.9977170,,,,0.00016000999312382,
KIYAELDSVR,me1,K,31,true,"Arabidopsis protein methylome",123,31809900,"MaxQuant Score",124.1200000,1.0000000,,,,1.7844899819972E-13,-0.5112700
KIYAELDSVR,me2,K,31,true,"Arabidopsis protein methylome",123,31809900,"MaxQuant Score",122.7000000,1.0000000,,,,4.8993598511515E-8,-0.1473300
ELETKIGSLQEDLSSCK,ac,K,253,true,"Histone deacetylases - apicidin vs control",98a,29061669,"MaxQuant Score",147.1000000,1.0000000,-0.0640000,0.7211075,NO,8.2999997253934E-29,
ELETKIGSLQEDLSSCK,ac,K,253,true,"Histone deacetylases substrates - hda14 vs WT",98e,29061669,"MaxQuant Score",45.0000000,1.0000000,-0.2230000,0.9120108,NO,0.0010000000474975,
ALEARLSQVESSYK,ph,S,319,true,"srk2dei ABA signaling phopshoproteomics",83,23572148,"MASCOT Score",31.0000000,,,,,,0.0042000
VVEAYCLVNQK,so,C,470,true,"S-sulfenylation site detection using YAP1C",110,32714340,,,,,,,,
DDDEDDYPLLSDVEMEMESEADKIISEHLLK,ph,S,547,true,"SnRK2 protein kinase substrates",85,23776212,XCorr,4.3093510,0.7910000,,,,0.00016832699475344,
DDDEDDYPLLSDVEMEMESEADK,ph,S,547,true,"TOR Kinase and ABA Receptor",100,29290610,XCorr,4.2940674,1.0000000,,,,5.3949997891323E-7,
SLSEQIESR,ph,S,589,true,"atm and atr DNA damage response",88,25561503,"MASCOT Score",40.0000000,1.0000000,,,,,-1.2300000
SLSEQIESR,ph,S,589,true,"Tissue atlas Arabidopsis - ProteomicsDB",114,32188942,"MaxQuant score",131.4200000,0.9999630,,,,0.00011506200098665,
SSDLSPAVVPGR,ph,S,659,true,"atm and atr DNA damage response",88,25561503,"MASCOT Score",49.0000000,0.9480000,,,,,0.2900000
SSDLSPAVVPGR,ph,S,659,true,"Phospho cell culture sucrose/TOR",109,30833711,,,0.8477940,,,,,
SSDLSPAVVPGR,ph,S,660,true,"atm and atr DNA damage response",88,25561503,"MASCOT Score",40.0000000,0.9970000,,,,,-0.5800000
SSDLSPAVVPGR,ph,S,660,true,"Tissue atlas Arabidopsis - ProteomicsDB",114,32188942,"MaxQuant score",139.7600000,0.7595690,,,,9.8745504146791E-6,
SSDLSPAVVPGRK,ph,S,663,true,"TOR Kinase and ABA Receptor",100,29290610,XCorr,2.4420950,0.9998000,,,,0.0021180000621825,
SSDLSPAVVPGRK,ph,S,663,true,"Col-0 callus - FC Col-0 vs. Col-0 Xray",111a,31410901,,41.8400000,,-0.0970444,0.0000000,NO,,0.8228380
SSDLSPAVVPGRK,ph,S,663,true,"Col-0 X-ray callus - FC Col-0 vs. Col-0 Xray",111b,31410901,,41.8400000,,-0.0970444,0.0000000,NO,,0.8228380
SSDLSPAVVPGRK,ph,S,663,true,"atm callus - FC atm vs. atm Xray",111c,31410901,,41.8400000,,0.5030737,0.0000000,NO,,0.8228380
SSDLSPAVVPGRK,ph,S,663,true,"atm-3 X-ray callus - FC atm vs. atm Xray",111d,31410901,,41.8400000,,0.5030737,0.0000000,NO,,0.8228380
SSDLSPAVVPGR,ph,S,663,true,"atm and atr DNA damage response",88,25561503,"MASCOT Score",64.0000000,1.0000000,,,,,0.2100000
SSDLSPAVVPGR,ph,S,663,true,"Col-0 callus - FC Col-0 vs. Col-0 Xray",111a,31410901,,66.7900000,,-0.2871843,0.0000000,NO,,0.2617985
SSDLSPAVVPGR,ph,S,663,true,"Col-0 X-ray callus - FC Col-0 vs. Col-0 Xray",111b,31410901,,66.7900000,,-0.2871843,0.0000000,NO,,0.2617985
SSDLSPAVVPGR,ph,S,663,true,"atm callus - FC atm vs. atm Xray",111c,31410901,,66.7900000,,0.2470426,0.0000000,NO,,0.2617985
SSDLSPAVVPGR,ph,S,663,true,"atm-3 X-ray callus - FC atm vs. atm Xray",111d,31410901,,66.7900000,,0.2470426,0.0000000,NO,,0.2617985
SSDLSPAVVPGR,ph,S,663,true,"Tissue atlas Arabidopsis - ProteomicsDB",114,32188942,"MaxQuant score",191.7900000,1.0000000,,,,2.7730699211337E-24,
NFLHLLEDSEEATKR,ac,K,685,true,"Quantitative Acetylproteomics",101,29440448,,,,,,,,
ILEEDFAKAR,ac,K,704,true,"Histone deacetylases - apicidin vs control",98a,29061669,"MaxQuant Score",133.8000000,1.0000000,-0.0420000,0.8649679,NO,3.9999998868723E-9,
ILEEDFAKAR,ac,K,704,true,"Histone deacetylases substrates - TSA vs control",98b,29061669,"MaxQuant Score",133.8000000,1.0000000,0.1320000,0.9908319,NO,3.9999998868723E-9,
ILEEDFAKAR,ac,K,704,true,"Histone deacetylases- hda14 vs WT (low light)",98c,29061669,"MaxQuant Score",122.5700000,1.0000000,0.1370000,0.9885531,NO,0.0020000000949949,
ILEEDFAKAR,ac,K,704,true,"Histone deacetylases - hda14 vs WT (thylakoids)",98d,29061669,"MaxQuant Score",82.4000000,1.0000000,0.2570000,0.8892011,NO,0.0070000002160668,
ILEEDFAKAR,ac,K,704,true,"Histone deacetylases substrates - hda14 vs WT",98e,29061669,"MaxQuant Score",71.2000000,1.0000000,0.0560000,0.9204496,NO,0.0009299999801442,
ILEEDFAKAR,ac,K,704,true,"Quantitative Acetylproteomics",101,29440448,,,,,,,,
ILEEDFAKAR,me1,K,704,true,"Arabidopsis protein methylome",123,31809900,"MaxQuant Score",162.8800000,1.0000000,,,,0,-0.1117900
EKLEGIMKESER,me2,K,729,true,"Arabidopsis protein methylome",123,31809900,"MaxQuant Score",74.7890000,0.9999990,,,,0.0015615100273862,-0.2967200
KLSMEVSVLK,me2,K,781,true,"Arabidopsis protein methylome",123,31809900,"MaxQuant Score",111.8600000,1.0000000,,,,1.1292499948468E-6,0.3727200
TLDMDSGGIVSLSDK,ph,S,932,true,"srk2dei ABA signaling phopshoproteomics",83,23572148,"MASCOT Score",20.0000000,,,,,,0.0027000
LRGEVESSKSHMLQYK,ph,S,963,true,"Tissue atlas Arabidopsis - ProteomicsDB",114,32188942,"MaxQuant score",57.4340000,0.9999970,,,,0.0067260898649693,
GIENSELNAKWSEEK,me2,K,1136,true,"Arabidopsis protein methylome",123,31809900,"MaxQuant Score",216.9900000,1.0000000,,,,0,0.2378700
SGTISSGSTDSDHLEDSGLQR,ph,S,1187,true,"Tissue atlas Arabidopsis - ProteomicsDB",114,32188942,"MaxQuant score",101.7600000,0.9654460,,,,7.6751099920003E-10,
SGTISSGSTDSDHLEDSGLQR,ph,S,1193,true,"Tissue atlas Arabidopsis - ProteomicsDB",114,32188942,"MaxQuant score",92.4630000,0.8210080,,,,5.4707701480083E-8,
LQSQLESALK,ph,S,1235,true,"Tissue atlas Arabidopsis - ProteomicsDB",114,32188942,"MaxQuant score",124.3900000,1.0000000,,,,9.877639968181E-5,
EVAQKAR,me1,K,1304,true,"Arabidopsis protein methylome",123,31809900,"MaxQuant Score",164.2400000,1.0000000,,,,0,-0.2657500
EVAQKAR,me2,K,1304,true,"Arabidopsis protein methylome",123,31809900,"MaxQuant Score",117.1600000,1.0000000,,,,0.0034667700529099,0.1177100
QNQSLAK,ph,S,1466,true,"Immuno-dot blot phosphorylation",31,19341826,"MASCOT Score",54.5200000,,,,,,
TTTDAVVEQSVKER,me1,K,1493,true,"Arabidopsis protein methylome",123,31809900,"MaxQuant Score",154.6900000,1.0000000,,,,0,3.1624000
TTTDAVVEQSVKER,me2,K,1493,true,"Arabidopsis protein methylome",123,31809900,"MaxQuant Score",56.5690000,1.0000000,,,,0.0053807101212442,0.5148100
VPSSTPLIKSPVATTQQLPK,ph,S,1659,true,"Tissue atlas Arabidopsis - ProteomicsDB",114,32188942,"MaxQuant score",216.1900000,0.9952480,,,,0,
VPSSTPLIK,ph,S,1659,true,"atm and atr DNA damage response",88,25561503,"MASCOT Score",24.0000000,1.0000000,,,,,-1.5800000
VPSSTPLIK,ph,S,1659,true,"TOR Kinase and ABA Receptor",100,29290610,XCorr,2.6852643,0.9960000,,,,0.00059720000717789,
VPSSTPLIKSPVATTQQLPK,ph,S,1666,true,"TOR Kinase and ABA Receptor",100,29290610,XCorr,3.3571892,1.0000000,,,,0.00050750002264977,
VPSSTPLIKSPVATTQQLPK,ph,S,1666,true,"Phospho cell culture sucrose/TOR",109,30833711,,,0.9977240,,,,,
SPVATTQQLPK,ph,S,1666,true,"atm and atr DNA damage response",88,25561503,"MASCOT Score",29.0000000,0.9490000,,,,,-0.9500000
SPVATTQQLPK,ph,S,1666,true,"TOR Kinase and ABA Receptor",100,29290610,XCorr,2.8656764,1.0000000,,,,0.014879999682307,
SPVATTQQLPK,ph,S,1666,true,"Tissue atlas Arabidopsis - ProteomicsDB",114,32188942,"MaxQuant score",338.6700000,1.0000000,,,,0,
GSESHPDTSEGENLAK,ph,S,1798,true,"Tissue atlas Arabidopsis - ProteomicsDB",114,32188942,"MaxQuant score",188.1600000,0.9749610,,,,3.0747999266947E-27,
EPAIDELMDATTTTDGDNEETEAENAEEK,ph,T,1819,true,"TOR Kinase and ABA Receptor",100,29290610,XCorr,4.1858330,0.8074000,,,,1.5989999155863E-5,
DQTEEENQEPLTDMESDK,ph,T,1880,true,"srk2dei ABA signaling phopshoproteomics",83,23572148,"MASCOT Score",33.0000000,,,,,,0.0009000
DQTEEENQEPLTDMESDK,ph,S,1884,true,"srk2dei ABA signaling phopshoproteomics",83,23572148,"MASCOT Score",41.0000000,,,,,,-0.0006000
SPEKEEVQPETLATPTQSPSR,ph,S,1911,true,"LAXIC - mannitol vs control",84b,23660473,XCorr,5.5600000,1.0000000,,,,2.3600000212664E-15,
SPEKEEVQPETLATPTQSPSR,ph,S,1911,true,"SnRK2 protein kinase substrates",85,23776212,XCorr,3.0038509,1.0000000,,,,0.00079546798951924,
SPEKEEVQPETLATPTQSPSR,ph,S,1911,true,"atm and atr DNA damage response",88,25561503,"MASCOT Score",52.0000000,1.0000000,,,,,0.2200000
SPEKEEVQPETLATPTQSPSR,ph,S,1911,true,"Phospho cell culture sucrose/TOR",109,30833711,,,1.0000000,,,,,
SPEKEEVQPETLATPTQSPSR,ph,S,1911,true,"Col-0 callus - FC Col-0 vs. Col-0 Xray",111a,31410901,,75.9300000,,-0.6536151,0.0000000,NO,,1.2187538
SPEKEEVQPETLATPTQSPSR,ph,S,1911,true,"Col-0 X-ray callus - FC Col-0 vs. Col-0 Xray",111b,31410901,,75.9300000,,-0.6536151,0.0000000,NO,,1.2187538
SPEKEEVQPETLATPTQSPSR,ph,S,1911,true,"atm callus - FC atm vs. atm Xray",111c,31410901,,75.9300000,,0.9103342,0.0000000,NO,,1.2187538
SPEKEEVQPETLATPTQSPSR,ph,S,1911,true,"atm-3 X-ray callus - FC atm vs. atm Xray",111d,31410901,,75.9300000,,0.9103342,0.0000000,NO,,1.2187538
SPEKEEVQPETLATPTQSPSR,ph,S,1911,true,"Tissue atlas Arabidopsis - ProteomicsDB",114,32188942,"MaxQuant score",438.4900000,1.0000000,,,,0,
SPEKEEVQPETLATPTQSPSR,ph,T,1921,true,"Col-0 callus - FC Col-0 vs. Col-0 Xray",111a,31410901,,24.4200000,,-0.5307149,0.0000000,NO,,1.0282093
SPEKEEVQPETLATPTQSPSR,ph,T,1921,true,"Col-0 X-ray callus - FC Col-0 vs. Col-0 Xray",111b,31410901,,24.4200000,,-0.5307149,0.0000000,NO,,1.0282093
SPEKEEVQPETLATPTQSPSR,ph,T,1921,true,"atm callus - FC atm vs. atm Xray",111c,31410901,,24.4200000,,-0.2684026,0.0000000,NO,,1.0282093
SPEKEEVQPETLATPTQSPSR,ph,T,1921,true,"atm-3 X-ray callus - FC atm vs. atm Xray",111d,31410901,,24.4200000,,-0.2684026,0.0000000,NO,,1.0282093
EEVQPETLATPTQSPSRMETAMEEAETTIETPVEDDK,ph,T,1924,true,"TOR Kinase and ABA Receptor",100,29290610,XCorr,2.9187403,0.9019000,,,,0.0034469999372959,
SPEKEEVQPETLATPTQSPSR,ph,T,1924,true,"LAXIC - ABA stress",84a,23660473,XCorr,5.3300000,0.9130000,,,,0.0037042500916868,
SPEKEEVQPETLATPTQSPSR,ph,T,1924,true,"LAXIC - mannitol vs control",84b,23660473,XCorr,6.0100000,0.9970000,-1.3058908,,NO,2.8699998892989E-6,
SPEKEEVQPETLATPTQSPSR,ph,T,1924,true,"SnRK2 protein kinase substrates",85,23776212,XCorr,5.0060754,0.9910000,,,,0.0079244701191783,
SPEKEEVQPETLATPTQSPSR,ph,T,1924,true,"Phospho cell culture sucrose/TOR",109,30833711,,,0.9945680,,,,,
SPEKEEVQPETLATPTQSPSR,ph,T,1924,true,"Col-0 callus - FC Col-0 vs. Col-0 Xray",111a,31410901,,59.3500000,,0.2818429,0.0000000,NO,,0.5880488
SPEKEEVQPETLATPTQSPSR,ph,T,1924,true,"Col-0 X-ray callus - FC Col-0 vs. Col-0 Xray",111b,31410901,,59.3500000,,0.2818429,0.0000000,NO,,0.5880488
SPEKEEVQPETLATPTQSPSR,ph,T,1924,true,"atm callus - FC atm vs. atm Xray",111c,31410901,,59.3500000,,-0.1217623,0.0000000,NO,,0.5880488
SPEKEEVQPETLATPTQSPSR,ph,T,1924,true,"atm-3 X-ray callus - FC atm vs. atm Xray",111d,31410901,,59.3500000,,-0.1217623,0.0000000,NO,,0.5880488
SPEKEEVQPETLATPTQSPSR,ph,T,1924,true,"Tissue atlas Arabidopsis - ProteomicsDB",114,32188942,"MaxQuant score",376.2900000,0.9999710,,,,0,
EEVQPETLATPTQSPSR,ph,T,1924,true,"STN8 phosphoproteome",38,21768351,"MASCOT Score",50.3200000,,,,,,
EEVQPETLATPTQSPSR,ph,T,1924,true,"srk2dei ABA signaling phopshoproteomics",83,23572148,"MASCOT Score",59.0000000,,,,,,-0.0001000
EEVQPETLATPTQSPSR,ph,T,1924,true,"LAXIC - mannitol vs control",84b,23660473,XCorr,3.7600000,0.9580000,,,,2.4899999839789E-9,
EEVQPETLATPTQSPSR,ph,T,1924,true,"SnRK2 protein kinase substrates",85,23776212,XCorr,2.8520830,1.0000000,,,,5.616210074777E-8,
EEVQPETLATPTQSPSR,ph,T,1924,true,"atm and atr DNA damage response",88,25561503,"MASCOT Score",58.0000000,1.0000000,,,,,-0.4900000
EEVQPETLATPTQSPSR,ph,T,1926,true,"srk2dei ABA signaling phopshoproteomics",83,23572148,"MASCOT Score",40.0000000,,,,,,0.0008000
SPEKEEVQPETLATPTQSPSR,ph,S,1928,true,"LAXIC - ABA stress",84a,23660473,XCorr,5.3300000,0.8370000,,,,0.0037042500916868,
SPEKEEVQPETLATPTQSPSR,ph,S,1928,true,"LAXIC - mannitol vs control",84b,23660473,XCorr,6.0100000,0.9440000,-1.3058908,,NO,2.8699998892989E-6,
SPEKEEVQPETLATPTQSPSR,ph,S,1928,true,"SnRK2 protein kinase substrates",85,23776212,XCorr,5.0060754,0.9350000,,,,0.0079244701191783,
SPEKEEVQPETLATPTQSPSR,ph,S,1928,true,"atm and atr DNA damage response",88,25561503,"MASCOT Score",26.0000000,0.8330000,,,,,0.4000000
SPEKEEVQPETLATPTQSPSR,ph,S,1928,true,"Phospho cell culture sucrose/TOR",109,30833711,,,0.9881460,,,,,
SPEKEEVQPETLATPTQSPSR,ph,S,1928,true,"Col-0 callus - FC Col-0 vs. Col-0 Xray",111a,31410901,,54.3500000,,0.3496770,0.0000000,NO,,0.8739316
SPEKEEVQPETLATPTQSPSR,ph,S,1928,true,"Col-0 X-ray callus - FC Col-0 vs. Col-0 Xray",111b,31410901,,54.3500000,,0.3496770,0.0000000,NO,,0.8739316
SPEKEEVQPETLATPTQSPSR,ph,S,1928,true,"atm callus - FC atm vs. atm Xray",111c,31410901,,54.3500000,,-0.4665023,0.0000000,NO,,0.8739316
SPEKEEVQPETLATPTQSPSR,ph,S,1928,true,"atm-3 X-ray callus - FC atm vs. atm Xray",111d,31410901,,54.3500000,,-0.4665023,0.0000000,NO,,0.8739316
SPEKEEVQPETLATPTQSPSR,ph,S,1928,true,"Tissue atlas Arabidopsis - ProteomicsDB",114,32188942,"MaxQuant score",438.4900000,0.9996960,,,,0,
EEVQPETLATPTQSPSR,ph,S,1928,true,"Tyrosine phosphorylation in Arabidopsis",59,18463617,"MASCOT Score",68.0000000,,,,,,-0.8209859
EEVQPETLATPTQSPSR,ph,S,1928,true,"srk2dei ABA signaling phopshoproteomics",83,23572148,"MASCOT Score",59.0000000,,,,,,-0.0001000
EEVQPETLATPTQSPSR,ph,S,1928,true,"LAXIC - mannitol vs control",84b,23660473,XCorr,3.7600000,0.9220000,,,,2.4899999839789E-9,
EEVQPETLATPTQSPSR,ph,S,1928,true,"atm and atr DNA damage response",88,25561503,"MASCOT Score",58.0000000,0.9980000,,,,,-0.4900000
SPEKEEVQPETLATPTQSPSR,ph,S,1930,true,"SnRK2 protein kinase substrates",85,23776212,XCorr,4.2175751,0.9070000,,,,0.00063736399170011,
SPEKEEVQPETLATPTQSPSR,ph,S,1930,true,"Col-0 callus - FC Col-0 vs. Col-0 Xray",111a,31410901,,24.4200000,,-0.5307149,0.0000000,NO,,1.0282093
SPEKEEVQPETLATPTQSPSR,ph,S,1930,true,"Col-0 X-ray callus - FC Col-0 vs. Col-0 Xray",111b,31410901,,24.4200000,,-0.5307149,0.0000000,NO,,1.0282093
SPEKEEVQPETLATPTQSPSR,ph,S,1930,true,"atm callus - FC atm vs. atm Xray",111c,31410901,,24.4200000,,-0.2684026,0.0000000,NO,,1.0282093
SPEKEEVQPETLATPTQSPSR,ph,S,1930,true,"atm-3 X-ray callus - FC atm vs. atm Xray",111d,31410901,,24.4200000,,-0.2684026,0.0000000,NO,,1.0282093
EEVQPETLATPTQSPSR,ph,S,1930,true,"srk2dei ABA signaling phopshoproteomics",83,23572148,"MASCOT Score",62.0000000,,,,,,0.0001000
EEVQPETLATPTQSPSR,ph,S,1930,true,"SnRK2 protein kinase substrates",85,23776212,XCorr,2.8520830,0.9400000,,,,5.616210074777E-8,
RAPSPGGGSSTIVTLADR,ph,S,2022,true,"Arabidopsis root NAA phosphoproteome",18a,27643528,"MaxQuant Score",55.8440000,0.9440000,,,,1.6849999155966E-5,0.0490000
RAPSPGGGSSTIVTLADR,ph,S,2022,true,"STN8 phosphoproteome",38,21768351,"MASCOT Score",99.8100000,,,,,,-1.0831000
RAPSPGGGSSTIVTLADR,ph,S,2022,true,"Pollen phosphoproteome Arabidopsis",43,22631563,"MASCOT Score",48.9100000,,,,,,
RAPSPGGGSSTIVTLADR,ph,S,2022,true,"Large-scale phosphorylation discovery",44,23111157,XCorr,4.1710000,,,,,,
RAPSPGGGSSTIVTLADR,ph,S,2022,true,"Phosphoproteome ethylene-regulated time response",46,24043427,"MASCOT Score",67.2600000,,,,,,-4.9705000
RAPSPGGGSSTIVTLADR,ph,S,2022,true,"PAMP-triggered phosphorylation",48,24601666,"MASCOT Score",43.8200000,,,,,,
RAPSPGGGSSTIVTLADR,ph,S,2022,true,"Chloroplast kinase substrates",60,19376835,"MASCOT Score",100.6000000,,,,,,-1.0831000
RAPSPGGGSSTIVTLADR,ph,S,2022,true,"srk2dei ABA signaling phopshoproteomics",83,23572148,"MASCOT Score",86.0000000,,,,,,0.0005000
RAPSPGGGSSTIVTLADR,ph,S,2022,true,"LAXIC - ABA stress",84a,23660473,XCorr,3.6000000,0.9740000,,,,1.2100000503779E-6,
RAPSPGGGSSTIVTLADR,ph,S,2022,true,"SnRK2 protein kinase substrates",85,23776212,XCorr,4.0467839,0.9030000,,,,0.00039334400207736,
RAPSPGGGSSTIVTLADR,ph,S,2022,true,"atm and atr DNA damage response",88,25561503,"MASCOT Score",91.0000000,1.0000000,,,,,-0.2700000
RAPSPGGGSSTIVTLADR,ph,S,2022,true,"TOR Kinase and ABA Receptor",100,29290610,XCorr,4.7253060,0.9896000,,,,5.9210001346344E-9,
RAPSPGGGSSTIVTLADR,ph,S,2022,true,"Phospho cell culture sucrose/TOR",109,30833711,,,0.9954080,,,,,
RAPSPGGGSSTIVTLADR,ph,S,2022,true,"Col-0 callus - FC Col-0 vs. Col-0 Xray",111a,31410901,,121.7100000,,-0.3284900,0.0000000,NO,,1.0638690
RAPSPGGGSSTIVTLADR,ph,S,2022,true,"Col-0 X-ray callus - FC Col-0 vs. Col-0 Xray",111b,31410901,,121.7100000,,-0.3284900,0.0000000,NO,,1.0638690
RAPSPGGGSSTIVTLADR,ph,S,2022,true,"atm callus - FC atm vs. atm Xray",111c,31410901,,121.7100000,,-0.0433058,0.0000000,NO,,1.0638690
RAPSPGGGSSTIVTLADR,ph,S,2022,true,"atm-3 X-ray callus - FC atm vs. atm Xray",111d,31410901,,121.7100000,,-0.0433058,0.0000000,NO,,1.0638690
APSPGGGSSTIVTLADR,ph,S,2022,true,"STN8 phosphoproteome",38,21768351,"MASCOT Score",94.2900000,,,,,,-2.0670700
APSPGGGSSTIVTLADR,ph,S,2022,true,"Chloroplast kinase substrates",60,19376835,"MASCOT Score",99.1600000,,,,,,-0.6271820
APSPGGGSSTIVTLADR,ph,S,2022,true,"SnRK2 protein kinase substrates",85,23776212,XCorr,3.9390552,1.0000000,,,,2.6793500144257E-12,
APSPGGGSSTIVTLADR,ph,S,2022,true,"atm and atr DNA damage response",88,25561503,"MASCOT Score",112.0000000,1.0000000,,,,,-0.0600000
APSPGGGSSTIVTLADR,ph,S,2022,true,"Col-0 callus - FC Col-0 vs. Col-0 Xray",111a,31410901,,94.5200000,,0.5690034,0.0000000,NO,,0.8836903
APSPGGGSSTIVTLADR,ph,S,2022,true,"Col-0 X-ray callus - FC Col-0 vs. Col-0 Xray",111b,31410901,,94.5200000,,0.5690034,0.0000000,NO,,0.8836903
APSPGGGSSTIVTLADR,ph,S,2022,true,"atm callus - FC atm vs. atm Xray",111c,31410901,,94.5200000,,0.4212742,0.0000000,NO,,0.8836903
APSPGGGSSTIVTLADR,ph,S,2022,true,"atm-3 X-ray callus - FC atm vs. atm Xray",111d,31410901,,94.5200000,,0.4212742,0.0000000,NO,,0.8836903
APSPGGGSSTIVTLADR,ph,S,2022,true,"Tissue atlas Arabidopsis - ProteomicsDB",114,32188942,"MaxQuant score",219.0100000,1.0000000,,,,0,
RAPSPGGGSSTIVTLADR,ph,S,2027,true,"Ethylene-regulated phosphorylation ein2 mutant",30,19253305,"MASCOT Score",47.6190000,,,,,,-1.4078243
RAPSPGGGSSTIVTLADR,ph,S,2027,true,"srk2dei ABA signaling phopshoproteomics",83,23572148,"MASCOT Score",75.0000000,,,,,,0.0008000
RAPSPGGGSSTIVTLADR,ph,S,2028,true,"Conserved plant phosphoproteome - Arabidopsis",61a,20466843,"MASCOT Score",45.0000000,1.0000000,,,,,
RAPSPGGGSSTIVTLADR,ph,S,2028,true,"srk2dei ABA signaling phopshoproteomics",83,23572148,"MASCOT Score",63.0000000,,,,,,0.0019000
RAPSPGGGSSTIVTLADR,ph,S,2028,true,"Col-0 callus - FC Col-0 vs. Col-0 Xray",111a,31410901,,41.8200000,,-0.2764112,0.0000000,NO,,0.1413567
RAPSPGGGSSTIVTLADR,ph,S,2028,true,"Col-0 X-ray callus - FC Col-0 vs. Col-0 Xray",111b,31410901,,41.8200000,,-0.2764112,0.0000000,NO,,0.1413567
RAPSPGGGSSTIVTLADR,ph,S,2028,true,"atm callus - FC atm vs. atm Xray",111c,31410901,,41.8200000,,-0.5198974,0.0000000,NO,,0.1413567
RAPSPGGGSSTIVTLADR,ph,S,2028,true,"atm-3 X-ray callus - FC atm vs. atm Xray",111d,31410901,,41.8200000,,-0.5198974,0.0000000,NO,,0.1413567
RAPSPGGGSSTIVTLADR,ph,T,2029,true,"srk2dei ABA signaling phopshoproteomics",83,23572148,"MASCOT Score",38.0000000,,,,,,0.0011000
GRTVNLR,ph,T,2065,true,"srk2dei ABA signaling phopshoproteomics",83,23572148,"MASCOT Score",23.0000000,,,,,,0.0000000
