Peptide,PTM,ModifiedAA,ModifiedPosition,PeptideUniqueToGene,ExperimentDesc,ExpID,PubmedID,ScoreType,IdentScore,LocProb,Log2FChange,PQ-val,QuantSig,PEP,MassErrorPPM
AMASTGVETKAGYSTSSVSTSEPVVSV,nt,A,57,true,"Arabidopsis translation initiation landscape - NT",167b,35069635,,,,,,,,
AMASTGVETKAGY,nt,A,57,true,"Arg/N-end rule seed, prt6 vs. Wt",99,29168982,"MASCOT Score",48.2400000,,,,,0.025110000744462,-1.7048129
AMASTGVETKAGYSTSSVSTSEPVVSV,nta,A,57,true,"Arabidopsis translation initiation landscape - NTA",167a,35069635,,,,,,,,
AMASTGVETKAGY,nta,A,57,true,"Arg/N-end rule seed, prt6 vs. Wt",99,29168982,"MASCOT Score",48.2400000,,-0.2715539,0.3936818,NO,0.025110000744462,-1.7048129
AMASTGVETK,nta,A,57,true,"Characterization plant N-terminal acetylation",6,22223895,"MASCOT Score",65.5200000,,,,,,
ASTGVETKAGYSTSSVSTSEPVVSVDWLHANLR,nta,A,59,true,"HUNTER N-terminome: legumain, GluC and trypsin",119,31951383,"MaxQuant score",56.0410000,,,,,,
STSSVSTSEPVVSVDWLHANLREPD,nt,S,70,true,"HUNTER N-terminome: legumain, GluC and trypsin",119,31951383,"MaxQuant score",79.4450000,,,,,,
STSSVSTSEPVVSVDWLHANLR,nt,S,70,true,"Arg/N-end rule pathway Roots",80,25728785,"MASCOT Score",74.6000000,,,,,8.3949998952448E-7,
STSSVSTSEPVVSVDWLHANLR,nt,S,70,true,"FtsH12 N-terminome: WT / FtsH12 knockdown miRNA",118,33216923,"MaxQuant score",142.9200000,,-0.3484419,0.1844571,NO,0,
STSSVSTSEPVVSVDWLHANLR,nt,S,70,true,"HUNTER N-terminome: legumain, GluC and trypsin",119,31951383,"MaxQuant score",70.1210000,,,,,,
STSSVSTSEPVVSVDWLHAN,nt,S,70,true,"HUNTER N-terminome: legumain, GluC and trypsin",119,31951383,"MaxQuant score",163.3300000,,,,,,
SALGIDNKDE,nt,S,153,true,"Arg/N-end rule seed, prt6 vs. Wt",99,29168982,"MASCOT Score",25.7800000,,-0.4622314,0.0043578,NO,0.001083999988623,0.1348731
NTLLPAEE,nt,N,306,true,"Arg/N-end rule seed, prt6 vs. Wt",99,29168982,"MASCOT Score",38.4600000,,-0.3887414,0.0435917,NO,0.020749999210238,0.2711176
